{"text_format":"1","workbook":"xlsx","n_sheets":14,"sheets":["Vaktliste","nn (1)","nn (2)","nn (3)","nn (4)","nn (5)","nn (6)","nn (7)","nn (8)","nn (9)","nn (10)","Vaktperiode","Modul2","Mottaker av faktura"],"not_rendered":{"charts":0,"images":0,"macros":1,"external_links":0,"defined_names":65,"comments":10,"pivot_tables":0},"unopened":[{"sheet":"Modul2","index":12,"reason":"part_missing"}],"bounds":{"document_bytes":16777216,"sheet_cells":100000,"rows_first":2000,"rows_last":500,"rows_between":2000,"halvings":0,"cell_chars":16384,"cell_head_chars":4096},"cells_cut":0,"cells_raw":0,"read":"whole","date_system":"1900"}

{"sheet":"Vaktliste","index":0,"n_rows":1422,"n_cols":11,"rows_kept":1422,"cut":false,"hidden":false,"merged":[[1418,4,1418,5],[1418,6,1418,7],[1421,4,1421,5],[1421,6,1421,7],[1419,4,1419,5],[1419,6,1419,7],[1420,4,1420,5],[1420,6,1420,7],[1415,4,1415,5],[1415,6,1415,7],[1416,4,1416,5],[1416,6,1416,7],[1417,4,1417,5],[1417,6,1417,7],[1412,4,1412,5],[1412,6,1412,7],[1413,4,1413,5],[1413,6,1413,7],[1414,4,1414,5],[1414,6,1414,7],[1,4,1,7],[2,4,2,7],[0,4,0,7],[3,4,3,7],[1411,4,1411,5],[1411,6,1411,7]]}
["X","VAKTLISTE",null,"Primært vaktområde","Primært vaktområde"]
[{"$f":"MONTH(B3)","v":1},"For periode:",null,"Sekundært vaktområde:","Sekundært vaktområde"]
[null,"2026-01-01",null,"Sekundært vaktområde:","Eventuelt andre sekundære vaktområde"]
[null,null,null,"Tilhørende regionskontor i Mattilsynet"]
["X","Dato     ","Vaktperiode",null,"Ordinær","Sesong","Vakans"]
[{"$f":"IF(B6=\"\",\"\",MONTH(B6))","v":1},"2026-01-01","4f",{"$f":"IF(C6=\"\",\"\",VLOOKUP(C6,Vaktperioder,2,0))","v":"Natt hellig- og høytidsdag 0000 - 0600"}]
[{"$f":"IF(B7=\"\",\"\",MONTH(B7))","v":1},"2026-01-01","3b","Hellig- og høytidsdag 0600 - 2200",null,null,null,null,null,null,{"$f":"IF(C6=\"3d\",IF(C7=\"4e\",0,1),0)","v":0}]
[1,"2026-01-01","4e","Natt hellig- og høytidsdag 2200 - 2400",null,null,null,null,null,null,{"$f":"IF(C7=\"3d\",IF(C8=\"4e\",0,1),0)","v":0}]
[1,"2026-01-02","4b","Natt hverdag 0000 - 0600",null,null,null,null,null,null,0]
[1,"2026-01-02","2a","Hverdag, morgen 0600 - 0800",null,null,null,null,null,null,0]
[1,"2026-01-02","1a","Hverdag, kveld 1600 - 2200",null,null,null,null,null,null,0]
[1,"2026-01-02","4a","Natt hverdag 2200 - 2400",null,null,null,null,null,null,0]
[1,"2026-01-03","4d","Natt lørdag, søndag 0000 - 0600",null,null,null,null,null,null,0]
[1,"2026-01-03","3a","Lørdag, søndag 0600 - 2200",null,null,null,null,null,null,0]
[1,"2026-01-03","4c","Natt lørdag, søndag 2200 - 2400",null,null,null,null,null,null,0]
[1,"2026-01-04","4d","Natt lørdag, søndag 0000 - 0600",null,null,null,null,null,null,0]
[1,"2026-01-04","3a","Lørdag, søndag 0600 - 2200",null,null,null,null,null,null,0]
[1,"2026-01-04","4c","Natt lørdag, søndag 2200 - 2400",null,null,null,null,null,null,0]
[1,"2026-01-05","4b","Natt hverdag 0000 - 0600",null,null,null,null,null,null,0]
[1,"2026-01-05","2a","Hverdag, morgen 0600 - 0800",null,null,null,null,null,null,0]
[1,"2026-01-05","1a","Hverdag, kveld 1600 - 2200",null,null,null,null,null,null,0]
[1,"2026-01-05","4a",{"$f":"IF(C22=\"\",\"\",VLOOKUP(C22,Vaktperioder,2,0))","v":"Natt hverdag 2200 - 2400"}]
[1,"2026-01-06","4b","Natt hverdag 0000 - 0600",null,null,null,null,null,null,{"$f":"IF(C21=\"3d\",IF(C23=\"4e\",0,1),0)","v":0}]
[1,"2026-01-06","2a","Hverdag, morgen 0600 - 0800",null,null,null,null,null,null,0]
[1,"2026-01-06","1a","Hverdag, kveld 1600 - 2200",null,null,null,null,null,null,0]
[1,"2026-01-06","4a","Natt hverdag 2200 - 2400",null,null,null,null,null,null,0]
[1,"2026-01-07","4b","Natt hverdag 0000 - 0600",null,null,null,null,null,null,0]
[1,"2026-01-07","2a","Hverdag, morgen 0600 - 0800",null,null,null,null,null,null,0]
[1,"2026-01-07","1a","Hverdag, kveld 1600 - 2200",null,null,null,null,null,null,0]
[1,"2026-01-07","4a","Natt hverdag 2200 - 2400",null,null,null,null,null,null,0]
[1,"2026-01-08","4b","Natt hverdag 0000 - 0600",null,null,null,null,null,null,0]
[1,"2026-01-08","2a","Hverdag, morgen 0600 - 0800",null,null,null,null,null,null,0]
[1,"2026-01-08","1a","Hverdag, kveld 1600 - 2200",null,null,null,null,null,null,0]
[1,"2026-01-08","4a","Natt hverdag 2200 - 2400",null,null,null,null,null,null,0]
[1,"2026-01-09","4b","Natt hverdag 0000 - 0600",null,null,null,null,null,null,0]
[1,"2026-01-09","2a","Hverdag, morgen 0600 - 0800",null,null,null,null,null,null,0]
[1,"2026-01-09","1a","Hverdag, kveld 1600 - 2200",null,null,null,null,null,null,0]
[1,"2026-01-09","4a","Natt hverdag 2200 - 2400",null,null,null,null,null,null,0]
[1,"2026-01-10","4d","Natt lørdag, søndag 0000 - 0600",null,null,null,null,null,null,0]
[1,"2026-01-10","3a","Lørdag, søndag 0600 - 2200",null,null,null,null,null,null,0]
[1,"2026-01-10","4c","Natt lørdag, søndag 2200 - 2400",null,null,null,null,null,null,0]
[1,"2026-01-11","4d","Natt lørdag, søndag 0000 - 0600",null,null,null,null,null,null,0]
[1,"2026-01-11","3a","Lørdag, søndag 0600 - 2200",null,null,null,null,null,null,0]
[1,"2026-01-11","4c","Natt lørdag, søndag 2200 - 2400",null,null,null,null,null,null,0]
[1,"2026-01-12","4b","Natt hverdag 0000 - 0600",null,null,null,null,null,null,0]
[1,"2026-01-12","2a","Hverdag, morgen 0600 - 0800",null,null,null,null,null,null,0]
[1,"2026-01-12","1a","Hverdag, kveld 1600 - 2200",null,null,null,null,null,null,0]
[1,"2026-01-12","4a","Natt hverdag 2200 - 2400",null,null,null,null,null,null,0]
[1,"2026-01-13","4b","Natt hverdag 0000 - 0600",null,null,null,null,null,null,0]
[1,"2026-01-13","2a","Hverdag, morgen 0600 - 0800",null,null,null,null,null,null,0]
[1,"2026-01-13","1a","Hverdag, kveld 1600 - 2200",null,null,null,null,null,null,0]
[1,"2026-01-13","4a","Natt hverdag 2200 - 2400",null,null,null,null,null,null,0]
[1,"2026-01-14","4b","Natt hverdag 0000 - 0600",null,null,null,null,null,null,0]
[1,"2026-01-14","2a","Hverdag, morgen 0600 - 0800",null,null,null,null,null,null,0]
[1,"2026-01-14","1a","Hverdag, kveld 1600 - 2200",null,null,null,null,null,null,0]
[1,"2026-01-14","4a","Natt hverdag 2200 - 2400",null,null,null,null,null,null,0]
[1,"2026-01-15","4b","Natt hverdag 0000 - 0600",null,null,null,null,null,null,0]
[1,"2026-01-15","2a","Hverdag, morgen 0600 - 0800",null,null,null,null,null,null,0]
[1,"2026-01-15","1a","Hverdag, kveld 1600 - 2200",null,null,null,null,null,null,0]
[1,"2026-01-15","4a","Natt hverdag 2200 - 2400",null,null,null,null,null,null,0]
[1,"2026-01-16","4b","Natt hverdag 0000 - 0600",null,null,null,null,null,null,0]
[1,"2026-01-16","2a","Hverdag, morgen 0600 - 0800",null,null,null,null,null,null,0]
[1,"2026-01-16","1a","Hverdag, kveld 1600 - 2200",null,null,null,null,null,null,0]
[1,"2026-01-16","4a","Natt hverdag 2200 - 2400",null,null,null,null,null,null,0]
[1,"2026-01-17","4d","Natt lørdag, søndag 0000 - 0600",null,null,null,null,null,null,0]
[1,"2026-01-17","3a","Lørdag, søndag 0600 - 2200",null,null,null,null,null,null,0]
[1,"2026-01-17","4c","Natt lørdag, søndag 2200 - 2400",null,null,null,null,null,null,0]
[1,"2026-01-18","4d","Natt lørdag, søndag 0000 - 0600",null,null,null,null,null,null,0]
[1,"2026-01-18","3a","Lørdag, søndag 0600 - 2200",null,null,null,null,null,null,0]
[1,"2026-01-18","4c","Natt lørdag, søndag 2200 - 2400",null,null,null,null,null,null,0]
[1,"2026-01-19","4b",{"$f":"IF(C71=\"\",\"\",VLOOKUP(C71,Vaktperioder,2,0))","v":"Natt hverdag 0000 - 0600"},null,null,null,null,null,null,0]
[{"$f":"IF(B72=\"\",\"\",MONTH(B72))","v":1},"2026-01-19","2a","Hverdag, morgen 0600 - 0800",null,null,null,null,null,null,0]
[1,"2026-01-19","1a","Hverdag, kveld 1600 - 2200",null,null,null,null,null,null,{"$f":"IF(C72=\"3d\",IF(C73=\"4e\",0,1),0)","v":0}]
[1,"2026-01-19","4a","Natt hverdag 2200 - 2400",null,null,null,null,null,null,0]
[1,"2026-01-20","4b","Natt hverdag 0000 - 0600",null,null,null,null,null,null,0]
[1,"2026-01-20","2a","Hverdag, morgen 0600 - 0800",null,null,null,null,null,null,0]
[1,"2026-01-20","1a","Hverdag, kveld 1600 - 2200",null,null,null,null,null,null,0]
[1,"2026-01-20","4a","Natt hverdag 2200 - 2400",null,null,null,null,null,null,0]
[1,"2026-01-21","4b","Natt hverdag 0000 - 0600",null,null,null,null,null,null,0]
[1,"2026-01-21","2a","Hverdag, morgen 0600 - 0800",null,null,null,null,null,null,0]
[1,"2026-01-21","1a","Hverdag, kveld 1600 - 2200",null,null,null,null,null,null,0]
[1,"2026-01-21","4a","Natt hverdag 2200 - 2400",null,null,null,null,null,null,0]
[1,"2026-01-22","4b","Natt hverdag 0000 - 0600",null,null,null,null,null,null,0]
[1,"2026-01-22","2a","Hverdag, morgen 0600 - 0800",null,null,null,null,null,null,0]
[1,"2026-01-22","1a","Hverdag, kveld 1600 - 2200",null,null,null,null,null,null,0]
[1,"2026-01-22","4a","Natt hverdag 2200 - 2400",null,null,null,null,null,null,0]
[1,"2026-01-23","4b","Natt hverdag 0000 - 0600",null,null,null,null,null,null,0]
[1,"2026-01-23","2a","Hverdag, morgen 0600 - 0800",null,null,null,null,null,null,0]
[1,"2026-01-23","1a","Hverdag, kveld 1600 - 2200",null,null,null,null,null,null,0]
[1,"2026-01-23","4a","Natt hverdag 2200 - 2400",null,null,null,null,null,null,0]
[1,"2026-01-24","4d","Natt lørdag, søndag 0000 - 0600",null,null,null,null,null,null,0]
[1,"2026-01-24","3a","Lørdag, søndag 0600 - 2200",null,null,null,null,null,null,0]
[1,"2026-01-24","4c","Natt lørdag, søndag 2200 - 2400",null,null,null,null,null,null,0]
[1,"2026-01-25","4d","Natt lørdag, søndag 0000 - 0600",null,null,null,null,null,null,0]
[1,"2026-01-25","3a","Lørdag, søndag 0600 - 2200",null,null,null,null,null,null,0]
[1,"2026-01-25","4c","Natt lørdag, søndag 2200 - 2400",null,null,null,null,null,null,0]
[1,"2026-01-26","4b","Natt hverdag 0000 - 0600",null,null,null,null,null,null,0]
[1,"2026-01-26","2a","Hverdag, morgen 0600 - 0800",null,null,null,null,null,null,0]
[1,"2026-01-26","1a","Hverdag, kveld 1600 - 2200",null,null,null,null,null,null,0]
[1,"2026-01-26","4a","Natt hverdag 2200 - 2400",null,null,null,null,null,null,0]
[1,"2026-01-27","4b","Natt hverdag 0000 - 0600",null,null,null,null,null,null,0]
[1,"2026-01-27","2a","Hverdag, morgen 0600 - 0800",null,null,null,null,null,null,0]
[1,"2026-01-27","1a","Hverdag, kveld 1600 - 2200",null,null,null,null,null,null,0]
[1,"2026-01-27","4a","Natt hverdag 2200 - 2400",null,null,null,null,null,null,0]
[1,"2026-01-28","4b","Natt hverdag 0000 - 0600",null,null,null,null,null,null,0]
[1,"2026-01-28","2a","Hverdag, morgen 0600 - 0800",null,null,null,null,null,null,0]
[1,"2026-01-28","1a","Hverdag, kveld 1600 - 2200",null,null,null,null,null,null,0]
[1,"2026-01-28","4a","Natt hverdag 2200 - 2400",null,null,null,null,null,null,0]
[1,"2026-01-29","4b","Natt hverdag 0000 - 0600",null,null,null,null,null,null,0]
[1,"2026-01-29","2a","Hverdag, morgen 0600 - 0800",null,null,null,null,null,null,0]
[1,"2026-01-29","1a","Hverdag, kveld 1600 - 2200",null,null,null,null,null,null,0]
[1,"2026-01-29","4a","Natt hverdag 2200 - 2400",null,null,null,null,null,null,0]
[1,"2026-01-30","4b","Natt hverdag 0000 - 0600",null,null,null,null,null,null,0]
[1,"2026-01-30","2a","Hverdag, morgen 0600 - 0800",null,null,null,null,null,null,0]
[1,"2026-01-30","1a","Hverdag, kveld 1600 - 2200",null,null,null,null,null,null,0]
[1,"2026-01-30","4a","Natt hverdag 2200 - 2400",null,null,null,null,null,null,0]
[1,"2026-01-31","4d","Natt lørdag, søndag 0000 - 0600",null,null,null,null,null,null,0]
[1,"2026-01-31","3a","Lørdag, søndag 0600 - 2200",null,null,null,null,null,null,0]
[1,"2026-01-31","4c","Natt lørdag, søndag 2200 - 2400",null,null,null,null,null,null,0]
[2,"2026-02-01","4d","Natt lørdag, søndag 0000 - 0600",null,null,null,null,null,null,0]
[2,"2026-02-01","3a","Lørdag, søndag 0600 - 2200",null,null,null,null,null,null,0]
[2,"2026-02-01","4c",{"$f":"IF(C122=\"\",\"\",VLOOKUP(C122,Vaktperioder,2,0))","v":"Natt lørdag, søndag 2200 - 2400"},null,null,null,null,null,null,0]
[2,"2026-02-02","4b","Natt hverdag 0000 - 0600",null,null,null,null,null,null,0]
[2,"2026-02-02","2a","Hverdag, morgen 0600 - 0800",null,null,null,null,null,null,0]
[2,"2026-02-02","1a",{"$f":"IF(C125=\"\",\"\",VLOOKUP(C125,Vaktperioder,2,0))","v":"Hverdag, kveld 1600 - 2200"},null,null,null,null,null,null,0]
[2,"2026-02-02","4a","Natt hverdag 2200 - 2400",null,null,null,null,null,null,0]
[2,"2026-02-03","4b","Natt hverdag 0000 - 0600",null,null,null,null,null,null,0]
[2,"2026-02-03","2a","Hverdag, morgen 0600 - 0800",null,null,null,null,null,null,0]
[2,"2026-02-03","1a","Hverdag, kveld 1600 - 2200",null,null,null,null,null,null,0]
[2,"2026-02-03","4a","Natt hverdag 2200 - 2400",null,null,null,null,null,null,0]
[2,"2026-02-04","4b","Natt hverdag 0000 - 0600",null,null,null,null,null,null,0]
[2,"2026-02-04","2a",{"$f":"IF(C132=\"\",\"\",VLOOKUP(C132,Vaktperioder,2,0))","v":"Hverdag, morgen 0600 - 0800"},null,null,null,null,null,null,0]
[{"$f":"IF(B133=\"\",\"\",MONTH(B133))","v":2},"2026-02-04","1a","Hverdag, kveld 1600 - 2200",null,null,null,null,null,null,0]
[2,"2026-02-04","4a","Natt hverdag 2200 - 2400",null,null,null,null,null,null,0]
[2,"2026-02-05","4b","Natt hverdag 0000 - 0600",null,null,null,null,null,null,0]
[2,"2026-02-05","2a","Hverdag, morgen 0600 - 0800",null,null,null,null,null,null,0]
[2,"2026-02-05","1a","Hverdag, kveld 1600 - 2200",null,null,null,null,null,null,{"$f":"IF(C136=\"3d\",IF(C137=\"4e\",0,1),0)","v":0}]
[2,"2026-02-05","4a","Natt hverdag 2200 - 2400",null,null,null,null,null,null,0]
[2,"2026-02-06","4b","Natt hverdag 0000 - 0600",null,null,null,null,null,null,0]
[2,"2026-02-06","2a","Hverdag, morgen 0600 - 0800",null,null,null,null,null,null,0]
[2,"2026-02-06","1a","Hverdag, kveld 1600 - 2200",null,null,null,null,null,null,0]
[2,"2026-02-06","4a","Natt hverdag 2200 - 2400",null,null,null,null,null,null,0]
[2,"2026-02-07","4d","Natt lørdag, søndag 0000 - 0600",null,null,null,null,null,null,0]
[2,"2026-02-07","3a","Lørdag, søndag 0600 - 2200",null,null,null,null,null,null,0]
[2,"2026-02-07","4c","Natt lørdag, søndag 2200 - 2400",null,null,null,null,null,null,0]
[2,"2026-02-08","4d","Natt lørdag, søndag 0000 - 0600",null,null,null,null,null,null,0]
[2,"2026-02-08","3a","Lørdag, søndag 0600 - 2200",null,null,null,null,null,null,0]
[2,"2026-02-08","4c","Natt lørdag, søndag 2200 - 2400",null,null,null,null,null,null,0]
[2,"2026-02-09","4b","Natt hverdag 0000 - 0600",null,null,null,null,null,null,0]
[2,"2026-02-09","2a","Hverdag, morgen 0600 - 0800",null,null,null,null,null,null,0]
[2,"2026-02-09","1a","Hverdag, kveld 1600 - 2200",null,null,null,null,null,null,0]
[2,"2026-02-09","4a","Natt hverdag 2200 - 2400",null,null,null,null,null,null,0]
[2,"2026-02-10","4b","Natt hverdag 0000 - 0600",null,null,null,null,null,null,0]
[2,"2026-02-10","2a","Hverdag, morgen 0600 - 0800",null,null,null,null,null,null,0]
[2,"2026-02-10","1a","Hverdag, kveld 1600 - 2200",null,null,null,null,null,null,0]
[2,"2026-02-10","4a","Natt hverdag 2200 - 2400",null,null,null,null,null,null,0]
[2,"2026-02-11","4b","Natt hverdag 0000 - 0600",null,null,null,null,null,null,0]
[2,"2026-02-11","2a","Hverdag, morgen 0600 - 0800",null,null,null,null,null,null,0]
[2,"2026-02-11","1a","Hverdag, kveld 1600 - 2200",null,null,null,null,null,null,0]
[2,"2026-02-11","4a","Natt hverdag 2200 - 2400",null,null,null,null,null,null,0]
[2,"2026-02-12","4b","Natt hverdag 0000 - 0600",null,null,null,null,null,null,0]
[2,"2026-02-12","2a","Hverdag, morgen 0600 - 0800",null,null,null,null,null,null,0]
[2,"2026-02-12","1a","Hverdag, kveld 1600 - 2200",null,null,null,null,null,null,0]
[2,"2026-02-12","4a","Natt hverdag 2200 - 2400",null,null,null,null,null,null,0]
[2,"2026-02-13","4b","Natt hverdag 0000 - 0600",null,null,null,null,null,null,0]
[2,"2026-02-13","2a","Hverdag, morgen 0600 - 0800",null,null,null,null,null,null,0]
[2,"2026-02-13","1a","Hverdag, kveld 1600 - 2200",null,null,null,null,null,null,0]
[2,"2026-02-13","4a","Natt hverdag 2200 - 2400",null,null,null,null,null,null,0]
[2,"2026-02-14","4d","Natt lørdag, søndag 0000 - 0600",null,null,null,null,null,null,0]
[2,"2026-02-14","3a","Lørdag, søndag 0600 - 2200",null,null,null,null,null,null,0]
[2,"2026-02-14","4c","Natt lørdag, søndag 2200 - 2400",null,null,null,null,null,null,0]
[2,"2026-02-15","4d","Natt lørdag, søndag 0000 - 0600",null,null,null,null,null,null,0]
[2,"2026-02-15","3a","Lørdag, søndag 0600 - 2200",null,null,null,null,null,null,0]
[2,"2026-02-15","4c","Natt lørdag, søndag 2200 - 2400",null,null,null,null,null,null,0]
[2,"2026-02-16","4b","Natt hverdag 0000 - 0600",null,null,null,null,null,null,0]
[2,"2026-02-16","2a","Hverdag, morgen 0600 - 0800",null,null,null,null,null,null,0]
[2,"2026-02-16","1a","Hverdag, kveld 1600 - 2200",null,null,null,null,null,null,0]
[2,"2026-02-16","4a","Natt hverdag 2200 - 2400",null,null,null,null,null,null,0]
[2,"2026-02-17","4b","Natt hverdag 0000 - 0600",null,null,null,null,null,null,0]
[2,"2026-02-17","2a","Hverdag, morgen 0600 - 0800",null,null,null,null,null,null,0]
[2,"2026-02-17","1a","Hverdag, kveld 1600 - 2200",null,null,null,null,null,null,0]
[2,"2026-02-17","4a","Natt hverdag 2200 - 2400",null,null,null,null,null,null,0]
[2,"2026-02-18","4b","Natt hverdag 0000 - 0600",null,null,null,null,null,null,0]
[2,"2026-02-18","2a","Hverdag, morgen 0600 - 0800",null,null,null,null,null,null,0]
[2,"2026-02-18","1a","Hverdag, kveld 1600 - 2200",null,null,null,null,null,null,0]
[2,"2026-02-18","4a","Natt hverdag 2200 - 2400",null,null,null,null,null,null,0]
[2,"2026-02-19","4b","Natt hverdag 0000 - 0600",null,null,null,null,null,null,0]
[2,"2026-02-19","2a","Hverdag, morgen 0600 - 0800",null,null,null,null,null,null,0]
[2,"2026-02-19","1a","Hverdag, kveld 1600 - 2200",null,null,null,null,null,null,0]
[2,"2026-02-19","4a","Natt hverdag 2200 - 2400",null,null,null,null,null,null,0]
[2,"2026-02-20","4b","Natt hverdag 0000 - 0600",null,null,null,null,null,null,0]
[2,"2026-02-20","2a","Hverdag, morgen 0600 - 0800",null,null,null,null,null,null,0]
[2,"2026-02-20","1a","Hverdag, kveld 1600 - 2200",null,null,null,null,null,null,0]
[2,"2026-02-20","4a","Natt hverdag 2200 - 2400",null,null,null,null,null,null,0]
[2,"2026-02-21","4d","Natt lørdag, søndag 0000 - 0600",null,null,null,null,null,null,0]
[2,"2026-02-21","3a",{"$f":"IF(C196=\"\",\"\",VLOOKUP(C196,Vaktperioder,2,0))","v":"Lørdag, søndag 0600 - 2200"},null,null,null,null,null,null,0]
[{"$f":"IF(B197=\"\",\"\",MONTH(B197))","v":2},"2026-02-21","4c","Natt lørdag, søndag 2200 - 2400",null,null,null,null,null,null,0]
[2,"2026-02-22","4d","Natt lørdag, søndag 0000 - 0600",null,null,null,null,null,null,0]
[2,"2026-02-22","3a","Lørdag, søndag 0600 - 2200",null,null,null,null,null,null,0]
[2,"2026-02-22","4c","Natt lørdag, søndag 2200 - 2400",null,null,null,null,null,null,0]
[2,"2026-02-23","4b","Natt hverdag 0000 - 0600",null,null,null,null,null,null,{"$f":"IF(C200=\"3d\",IF(C201=\"4e\",0,1),0)","v":0}]
[2,"2026-02-23","2a","Hverdag, morgen 0600 - 0800",null,null,null,null,null,null,0]
[2,"2026-02-23","1a","Hverdag, kveld 1600 - 2200",null,null,null,null,null,null,0]
[2,"2026-02-23","4a","Natt hverdag 2200 - 2400",null,null,null,null,null,null,0]
[2,"2026-02-24","4b","Natt hverdag 0000 - 0600",null,null,null,null,null,null,0]
[2,"2026-02-24","2a","Hverdag, morgen 0600 - 0800",null,null,null,null,null,null,0]
[2,"2026-02-24","1a","Hverdag, kveld 1600 - 2200",null,null,null,null,null,null,0]
[2,"2026-02-24","4a","Natt hverdag 2200 - 2400",null,null,null,null,null,null,0]
[2,"2026-02-25","4b","Natt hverdag 0000 - 0600",null,null,null,null,null,null,0]
[2,"2026-02-25","2a","Hverdag, morgen 0600 - 0800",null,null,null,null,null,null,0]
[2,"2026-02-25","1a","Hverdag, kveld 1600 - 2200",null,null,null,null,null,null,0]
[2,"2026-02-25","4a","Natt hverdag 2200 - 2400",null,null,null,null,null,null,0]
[2,"2026-02-26","4b","Natt hverdag 0000 - 0600",null,null,null,null,null,null,0]
[2,"2026-02-26","2a","Hverdag, morgen 0600 - 0800",null,null,null,null,null,null,0]
[2,"2026-02-26","1a","Hverdag, kveld 1600 - 2200",null,null,null,null,null,null,0]
[2,"2026-02-26","4a","Natt hverdag 2200 - 2400",null,null,null,null,null,null,0]
[2,"2026-02-27","4b","Natt hverdag 0000 - 0600",null,null,null,null,null,null,0]
[2,"2026-02-27","2a","Hverdag, morgen 0600 - 0800",null,null,null,null,null,null,0]
[2,"2026-02-27","1a","Hverdag, kveld 1600 - 2200",null,null,null,null,null,null,0]
[2,"2026-02-27","4a","Natt hverdag 2200 - 2400",null,null,null,null,null,null,0]
[2,"2026-02-28","4d","Natt lørdag, søndag 0000 - 0600",null,null,null,null,null,null,0]
[2,"2026-02-28","3a","Lørdag, søndag 0600 - 2200",null,null,null,null,null,null,0]
[2,"2026-02-28","4c","Natt lørdag, søndag 2200 - 2400",null,null,null,null,null,null,0]
[3,"2026-03-01","4d","Natt lørdag, søndag 0000 - 0600",null,null,null,null,null,null,0]
[3,"2026-03-01","3a","Lørdag, søndag 0600 - 2200",null,null,null,null,null,null,0]
[3,"2026-03-01","4c","Natt lørdag, søndag 2200 - 2400",null,null,null,null,null,null,0]
[3,"2026-03-02","4b","Natt hverdag 0000 - 0600",null,null,null,null,null,null,0]
[3,"2026-03-02","2a","Hverdag, morgen 0600 - 0800",null,null,null,null,null,null,0]
[3,"2026-03-02","1a","Hverdag, kveld 1600 - 2200",null,null,null,null,null,null,0]
[3,"2026-03-02","4a","Natt hverdag 2200 - 2400",null,null,null,null,null,null,0]
[3,"2026-03-03","4b","Natt hverdag 0000 - 0600",null,null,null,null,null,null,0]
[3,"2026-03-03","2a","Hverdag, morgen 0600 - 0800",null,null,null,null,null,null,0]
[3,"2026-03-03","1a","Hverdag, kveld 1600 - 2200",null,null,null,null,null,null,0]
[3,"2026-03-03","4a","Natt hverdag 2200 - 2400",null,null,null,null,null,null,0]
[3,"2026-03-04","4b","Natt hverdag 0000 - 0600",null,null,null,null,null,null,0]
[3,"2026-03-04","2a","Hverdag, morgen 0600 - 0800",null,null,null,null,null,null,0]
[3,"2026-03-04","1a","Hverdag, kveld 1600 - 2200",null,null,null,null,null,null,0]
[3,"2026-03-04","4a","Natt hverdag 2200 - 2400",null,null,null,null,null,null,0]
[3,"2026-03-05","4b","Natt hverdag 0000 - 0600",null,null,null,null,null,null,0]
[3,"2026-03-05","2a","Hverdag, morgen 0600 - 0800",null,null,null,null,null,null,0]
[3,"2026-03-05","1a","Hverdag, kveld 1600 - 2200",null,null,null,null,null,null,0]
[3,"2026-03-05","4a","Natt hverdag 2200 - 2400",null,null,null,null,null,null,0]
[3,"2026-03-06","4b","Natt hverdag 0000 - 0600",null,null,null,null,null,null,0]
[3,"2026-03-06","2a","Hverdag, morgen 0600 - 0800",null,null,null,null,null,null,0]
[3,"2026-03-06","1a","Hverdag, kveld 1600 - 2200",null,null,null,null,null,null,0]
[3,"2026-03-06","4a","Natt hverdag 2200 - 2400",null,null,null,null,null,null,0]
[3,"2026-03-07","4d","Natt lørdag, søndag 0000 - 0600",null,null,null,null,null,null,0]
[3,"2026-03-07","3a","Lørdag, søndag 0600 - 2200",null,null,null,null,null,null,0]
[3,"2026-03-07","4c","Natt lørdag, søndag 2200 - 2400",null,null,null,null,null,null,0]
[3,"2026-03-08","4d","Natt lørdag, søndag 0000 - 0600",null,null,null,null,null,null,0]
[3,"2026-03-08","3a","Lørdag, søndag 0600 - 2200",null,null,null,null,null,null,0]
[3,"2026-03-08","4c","Natt lørdag, søndag 2200 - 2400",null,null,null,null,null,null,0]
[3,"2026-03-09","4b","Natt hverdag 0000 - 0600",null,null,null,null,null,null,0]
[3,"2026-03-09","2a","Hverdag, morgen 0600 - 0800",null,null,null,null,null,null,0]
[3,"2026-03-09","1a","Hverdag, kveld 1600 - 2200",null,null,null,null,null,null,0]
[3,"2026-03-09","4a","Natt hverdag 2200 - 2400",null,null,null,null,null,null,0]
[3,"2026-03-10","4b","Natt hverdag 0000 - 0600",null,null,null,null,null,null,0]
[3,"2026-03-10","2a","Hverdag, morgen 0600 - 0800",null,null,null,null,null,null,0]
[3,"2026-03-10","1a","Hverdag, kveld 1600 - 2200",null,null,null,null,null,null,0]
[3,"2026-03-10","4a",{"$f":"IF(C260=\"\",\"\",VLOOKUP(C260,Vaktperioder,2,0))","v":"Natt hverdag 2200 - 2400"},null,null,null,null,null,null,0]
[{"$f":"IF(B261=\"\",\"\",MONTH(B261))","v":3},"2026-03-11","4b","Natt hverdag 0000 - 0600",null,null,null,null,null,null,0]
[3,"2026-03-11","2a","Hverdag, morgen 0600 - 0800",null,null,null,null,null,null,0]
[3,"2026-03-11","1a","Hverdag, kveld 1600 - 2200",null,null,null,null,null,null,0]
[3,"2026-03-11","4a","Natt hverdag 2200 - 2400",null,null,null,null,null,null,0]
[3,"2026-03-12","4b","Natt hverdag 0000 - 0600",null,null,null,null,null,null,{"$f":"IF(C264=\"3d\",IF(C265=\"4e\",0,1),0)","v":0}]
[3,"2026-03-12","2a","Hverdag, morgen 0600 - 0800",null,null,null,null,null,null,0]
[3,"2026-03-12","1a","Hverdag, kveld 1600 - 2200",null,null,null,null,null,null,0]
[3,"2026-03-12","4a","Natt hverdag 2200 - 2400",null,null,null,null,null,null,0]
[3,"2026-03-13","4b","Natt hverdag 0000 - 0600",null,null,null,null,null,null,0]
[3,"2026-03-13","2a","Hverdag, morgen 0600 - 0800",null,null,null,null,null,null,0]
[3,"2026-03-13","1a","Hverdag, kveld 1600 - 2200",null,null,null,null,null,null,0]
[3,"2026-03-13","4a","Natt hverdag 2200 - 2400",null,null,null,null,null,null,0]
[3,"2026-03-14","4d","Natt lørdag, søndag 0000 - 0600",null,null,null,null,null,null,0]
[3,"2026-03-14","3a","Lørdag, søndag 0600 - 2200",null,null,null,null,null,null,0]
[3,"2026-03-14","4c","Natt lørdag, søndag 2200 - 2400",null,null,null,null,null,null,0]
[3,"2026-03-15","4d","Natt lørdag, søndag 0000 - 0600",null,null,null,null,null,null,0]
[3,"2026-03-15","3a","Lørdag, søndag 0600 - 2200",null,null,null,null,null,null,0]
[3,"2026-03-15","4c","Natt lørdag, søndag 2200 - 2400",null,null,null,null,null,null,0]
[3,"2026-03-16","4b","Natt hverdag 0000 - 0600",null,null,null,null,null,null,0]
[3,"2026-03-16","2a","Hverdag, morgen 0600 - 0800",null,null,null,null,null,null,0]
[3,"2026-03-16","1a","Hverdag, kveld 1600 - 2200",null,null,null,null,null,null,0]
[3,"2026-03-16","4a","Natt hverdag 2200 - 2400",null,null,null,null,null,null,0]
[3,"2026-03-17","4b","Natt hverdag 0000 - 0600",null,null,null,null,null,null,0]
[3,"2026-03-17","2a","Hverdag, morgen 0600 - 0800",null,null,null,null,null,null,0]
[3,"2026-03-17","1a","Hverdag, kveld 1600 - 2200",null,null,null,null,null,null,0]
[3,"2026-03-17","4a","Natt hverdag 2200 - 2400",null,null,null,null,null,null,0]
[3,"2026-03-18","4b","Natt hverdag 0000 - 0600",null,null,null,null,null,null,0]
[3,"2026-03-18","2a","Hverdag, morgen 0600 - 0800",null,null,null,null,null,null,0]
[3,"2026-03-18","1a","Hverdag, kveld 1600 - 2200",null,null,null,null,null,null,0]
[3,"2026-03-18","4a","Natt hverdag 2200 - 2400",null,null,null,null,null,null,0]
[3,"2026-03-19","4b","Natt hverdag 0000 - 0600",null,null,null,null,null,null,0]
[3,"2026-03-19","2a","Hverdag, morgen 0600 - 0800",null,null,null,null,null,null,0]
[3,"2026-03-19","1a","Hverdag, kveld 1600 - 2200",null,null,null,null,null,null,0]
[3,"2026-03-19","4a","Natt hverdag 2200 - 2400",null,null,null,null,null,null,0]
[3,"2026-03-20","4b","Natt hverdag 0000 - 0600",null,null,null,null,null,null,0]
[3,"2026-03-20","2a","Hverdag, morgen 0600 - 0800",null,null,null,null,null,null,0]
[3,"2026-03-20","1a","Hverdag, kveld 1600 - 2200",null,null,null,null,null,null,0]
[3,"2026-03-20","4a","Natt hverdag 2200 - 2400",null,null,null,null,null,null,0]
[3,"2026-03-21","4d","Natt lørdag, søndag 0000 - 0600",null,null,null,null,null,null,0]
[3,"2026-03-21","3a","Lørdag, søndag 0600 - 2200",null,null,null,null,null,null,0]
[3,"2026-03-21","4c","Natt lørdag, søndag 2200 - 2400",null,null,null,null,null,null,0]
[3,"2026-03-22","4d","Natt lørdag, søndag 0000 - 0600",null,null,null,null,null,null,0]
[3,"2026-03-22","3a","Lørdag, søndag 0600 - 2200",null,null,null,null,null,null,0]
[3,"2026-03-22","4c","Natt lørdag, søndag 2200 - 2400",null,null,null,null,null,null,0]
[3,"2026-03-23","4b","Natt hverdag 0000 - 0600",null,null,null,null,null,null,0]
[3,"2026-03-23","2a","Hverdag, morgen 0600 - 0800",null,null,null,null,null,null,0]
[3,"2026-03-23","1a","Hverdag, kveld 1600 - 2200",null,null,null,null,null,null,0]
[3,"2026-03-23","4a","Natt hverdag 2200 - 2400",null,null,null,null,null,null,0]
[3,"2026-03-24","4b","Natt hverdag 0000 - 0600",null,null,null,null,null,null,0]
[3,"2026-03-24","2a","Hverdag, morgen 0600 - 0800",null,null,null,null,null,null,0]
[3,"2026-03-24","1a","Hverdag, kveld 1600 - 2200",null,null,null,null,null,null,0]
[3,"2026-03-24","4a","Natt hverdag 2200 - 2400",null,null,null,null,null,null,0]
[3,"2026-03-25","4b","Natt hverdag 0000 - 0600",null,null,null,null,null,null,0]
[3,"2026-03-25","2a","Hverdag, morgen 0600 - 0800",null,null,null,null,null,null,0]
[3,"2026-03-25","1a","Hverdag, kveld 1600 - 2200",null,null,null,null,null,null,0]
[3,"2026-03-25","4a","Natt hverdag 2200 - 2400",null,null,null,null,null,null,0]
[3,"2026-03-26","4b","Natt hverdag 0000 - 0600",null,null,null,null,null,null,0]
[3,"2026-03-26","2a","Hverdag, morgen 0600 - 0800",null,null,null,null,null,null,0]
[3,"2026-03-26","1a","Hverdag, kveld 1600 - 2200",null,null,null,null,null,null,0]
[3,"2026-03-26","4a","Natt hverdag 2200 - 2400",null,null,null,null,null,null,0]
[3,"2026-03-27","4b","Natt hverdag 0000 - 0600",null,null,null,null,null,null,0]
[3,"2026-03-27","2a","Hverdag, morgen 0600 - 0800",null,null,null,null,null,null,0]
[3,"2026-03-27","1a","Hverdag, kveld 1600 - 2200",null,null,null,null,null,null,0]
[3,"2026-03-27","4a",{"$f":"IF(C324=\"\",\"\",VLOOKUP(C324,Vaktperioder,2,0))","v":"Natt hverdag 2200 - 2400"},null,null,null,null,null,null,0]
[{"$f":"IF(B325=\"\",\"\",MONTH(B325))","v":3},"2026-03-28","4d","Natt lørdag, søndag 0000 - 0600",null,null,null,null,null,null,0]
[3,"2026-03-28","3a","Lørdag, søndag 0600 - 2200",null,null,null,null,null,null,0]
[3,"2026-03-28","4c","Natt lørdag, søndag 2200 - 2400",null,null,null,null,null,null,0]
[3,"2026-03-29","4d","Natt lørdag, søndag 0000 - 0600",null,null,null,null,null,null,0]
[3,"2026-03-29","3a","Lørdag, søndag 0600 - 2200",null,null,null,null,null,null,{"$f":"IF(C328=\"3d\",IF(C329=\"4e\",0,1),0)","v":0}]
[3,"2026-03-29","4c","Natt lørdag, søndag 2200 - 2400",null,null,null,null,null,null,0]
[3,"2026-03-30","4b","Natt hverdag 0000 - 0600",null,null,null,null,null,null,0]
[3,"2026-03-30","2a","Hverdag, morgen 0600 - 0800",null,null,null,null,null,null,0]
[3,"2026-03-30","1a","Hverdag, kveld 1600 - 2200",null,null,null,null,null,null,0]
[3,"2026-03-30","4a","Natt hverdag 2200 - 2400",null,null,null,null,null,null,0]
[3,"2026-03-31","4b","Natt hverdag 0000 - 0600",null,null,null,null,null,null,0]
[3,"2026-03-31","2a","Hverdag, morgen 0600 - 0800",null,null,null,null,null,null,0]
[3,"2026-03-31","1a","Hverdag, kveld 1600 - 2200",null,null,null,null,null,null,0]
[3,"2026-03-31","4a","Natt hverdag 2200 - 2400",null,null,null,null,null,null,0]
[4,"2026-04-01","4b","Natt hverdag 0000 - 0600",null,null,null,null,null,null,0]
[4,"2026-04-01","2a","Hverdag, morgen 0600 - 0800"]
[4,"2026-04-01","1a","Hverdag, kveld 1600 - 2200"]
[4,"2026-04-01","4a","Natt hverdag 2200 - 2400"]
[4,"2026-04-02","4f","Natt hellig- og høytidsdag 0000 - 0600"]
[4,"2026-04-02","3b","Hellig- og høytidsdag 0600 - 2200"]
[4,"2026-04-02","4e","Natt hellig- og høytidsdag 2200 - 2400"]
[4,"2026-04-03","4f","Natt hellig- og høytidsdag 0000 - 0600"]
[4,"2026-04-03","3b","Hellig- og høytidsdag 0600 - 2200"]
[4,"2026-04-03","4e","Natt hellig- og høytidsdag 2200 - 2400"]
[4,"2026-04-04","4f","Natt hellig- og høytidsdag 0000 - 0600"]
[4,"2026-04-04","3e","Påskeaften 0600 - 1200"]
[4,"2026-04-04","3d","Påske-, jul- og nyttårsaften 1200 - 2200"]
[4,"2026-04-04","4e","Natt hellig- og høytidsdag 2200 - 2400"]
[4,"2026-04-05","4f","Natt hellig- og høytidsdag 0000 - 0600"]
[4,"2026-04-05","3b","Hellig- og høytidsdag 0600 - 2200"]
[4,"2026-04-05","4e","Natt hellig- og høytidsdag 2200 - 2400"]
[4,"2026-04-06","4f","Natt hellig- og høytidsdag 0000 - 0600"]
[4,"2026-04-06","3b","Hellig- og høytidsdag 0600 - 2200"]
[4,"2026-04-06","4e","Natt hellig- og høytidsdag 2200 - 2400"]
[4,"2026-04-07","4b","Natt hverdag 0000 - 0600"]
[4,"2026-04-07","2a","Hverdag, morgen 0600 - 0800"]
[4,"2026-04-07","1a","Hverdag, kveld 1600 - 2200"]
[4,"2026-04-07","4a","Natt hverdag 2200 - 2400"]
[4,"2026-04-08","4b","Natt hverdag 0000 - 0600"]
[4,"2026-04-08","2a","Hverdag, morgen 0600 - 0800"]
[4,"2026-04-08","1a","Hverdag, kveld 1600 - 2200"]
[4,"2026-04-08","4a","Natt hverdag 2200 - 2400"]
[4,"2026-04-09","4b","Natt hverdag 0000 - 0600"]
[4,"2026-04-09","2a","Hverdag, morgen 0600 - 0800"]
[4,"2026-04-09","1a","Hverdag, kveld 1600 - 2200"]
[4,"2026-04-09","4a","Natt hverdag 2200 - 2400"]
[4,"2026-04-10","4b","Natt hverdag 0000 - 0600"]
[4,"2026-04-10","2a","Hverdag, morgen 0600 - 0800"]
[4,"2026-04-10","1a","Hverdag, kveld 1600 - 2200"]
[4,"2026-04-10","4a","Natt hverdag 2200 - 2400"]
[4,"2026-04-11","4d","Natt lørdag, søndag 0000 - 0600"]
[4,"2026-04-11","3a","Lørdag, søndag 0600 - 2200"]
[4,"2026-04-11","4c","Natt lørdag, søndag 2200 - 2400"]
[4,"2026-04-12","4d","Natt lørdag, søndag 0000 - 0600"]
[4,"2026-04-12","3a","Lørdag, søndag 0600 - 2200"]
[4,"2026-04-12","4c","Natt lørdag, søndag 2200 - 2400"]
[4,"2026-04-13","4b","Natt hverdag 0000 - 0600"]
[4,"2026-04-13","2a","Hverdag, morgen 0600 - 0800"]
[4,"2026-04-13","1a","Hverdag, kveld 1600 - 2200"]
[4,"2026-04-13","4a","Natt hverdag 2200 - 2400"]
[4,"2026-04-14","4b","Natt hverdag 0000 - 0600"]
[4,"2026-04-14","2a","Hverdag, morgen 0600 - 0800"]
[4,"2026-04-14","1a","Hverdag, kveld 1600 - 2200"]
[4,"2026-04-14","4a",{"$f":"IF(C388=\"\",\"\",VLOOKUP(C388,Vaktperioder,2,0))","v":"Natt hverdag 2200 - 2400"}]
[{"$f":"IF(B389=\"\",\"\",MONTH(B389))","v":4},"2026-04-15","4b","Natt hverdag 0000 - 0600"]
[4,"2026-04-15","2a","Hverdag, morgen 0600 - 0800"]
[4,"2026-04-15","1a","Hverdag, kveld 1600 - 2200"]
[4,"2026-04-15","4a","Natt hverdag 2200 - 2400"]
[4,"2026-04-16","4b","Natt hverdag 0000 - 0600"]
[4,"2026-04-16","2a","Hverdag, morgen 0600 - 0800"]
[4,"2026-04-16","1a","Hverdag, kveld 1600 - 2200"]
[4,"2026-04-16","4a","Natt hverdag 2200 - 2400"]
[4,"2026-04-17","4b","Natt hverdag 0000 - 0600"]
[4,"2026-04-17","2a","Hverdag, morgen 0600 - 0800"]
[4,"2026-04-17","1a","Hverdag, kveld 1600 - 2200"]
[4,"2026-04-17","4a","Natt hverdag 2200 - 2400"]
[4,"2026-04-18","4d","Natt lørdag, søndag 0000 - 0600"]
[4,"2026-04-18","3a","Lørdag, søndag 0600 - 2200"]
[4,"2026-04-18","4c","Natt lørdag, søndag 2200 - 2400"]
[4,"2026-04-19","4d","Natt lørdag, søndag 0000 - 0600"]
[4,"2026-04-19","3a","Lørdag, søndag 0600 - 2200"]
[4,"2026-04-19","4c","Natt lørdag, søndag 2200 - 2400"]
[4,"2026-04-20","4b","Natt hverdag 0000 - 0600"]
[4,"2026-04-20","2a","Hverdag, morgen 0600 - 0800"]
[4,"2026-04-20","1a","Hverdag, kveld 1600 - 2200"]
[4,"2026-04-20","4a","Natt hverdag 2200 - 2400"]
[4,"2026-04-21","4b","Natt hverdag 0000 - 0600"]
[4,"2026-04-21","2a","Hverdag, morgen 0600 - 0800"]
[4,"2026-04-21","1a","Hverdag, kveld 1600 - 2200"]
[4,"2026-04-21","4a","Natt hverdag 2200 - 2400"]
[4,"2026-04-22","4b","Natt hverdag 0000 - 0600"]
[4,"2026-04-22","2a","Hverdag, morgen 0600 - 0800"]
[4,"2026-04-22","1a","Hverdag, kveld 1600 - 2200"]
[4,"2026-04-22","4a","Natt hverdag 2200 - 2400"]
[4,"2026-04-23","4b","Natt hverdag 0000 - 0600"]
[4,"2026-04-23","2a","Hverdag, morgen 0600 - 0800"]
[4,"2026-04-23","1a","Hverdag, kveld 1600 - 2200"]
[4,"2026-04-23","4a","Natt hverdag 2200 - 2400"]
[{"$f":"IF(B423=\"\",\"\",MONTH(B423))","v":4},"2026-04-24","4b",{"$f":"IF(C423=\"\",\"\",VLOOKUP(C423,Vaktperioder,2,0))","v":"Natt hverdag 0000 - 0600"}]
[4,"2026-04-24","2a",{"$f":"IF(C424=\"\",\"\",VLOOKUP(C424,Vaktperioder,2,0))","v":"Hverdag, morgen 0600 - 0800"}]
[4,"2026-04-24","1a",{"$f":"IF(C425=\"\",\"\",VLOOKUP(C425,Vaktperioder,2,0))","v":"Hverdag, kveld 1600 - 2200"}]
[4,"2026-04-24","4a",{"$f":"IF(C426=\"\",\"\",VLOOKUP(C426,Vaktperioder,2,0))","v":"Natt hverdag 2200 - 2400"}]
[4,"2026-04-25","4d",{"$f":"IF(C427=\"\",\"\",VLOOKUP(C427,Vaktperioder,2,0))","v":"Natt lørdag, søndag 0000 - 0600"}]
[4,"2026-04-25","3a",{"$f":"IF(C428=\"\",\"\",VLOOKUP(C428,Vaktperioder,2,0))","v":"Lørdag, søndag 0600 - 2200"}]
[4,"2026-04-25","4c",{"$f":"IF(C429=\"\",\"\",VLOOKUP(C429,Vaktperioder,2,0))","v":"Natt lørdag, søndag 2200 - 2400"}]
[4,"2026-04-26","4d",{"$f":"IF(C430=\"\",\"\",VLOOKUP(C430,Vaktperioder,2,0))","v":"Natt lørdag, søndag 0000 - 0600"}]
[4,"2026-04-26","3a",{"$f":"IF(C431=\"\",\"\",VLOOKUP(C431,Vaktperioder,2,0))","v":"Lørdag, søndag 0600 - 2200"}]
[4,"2026-04-26","4c",{"$f":"IF(C432=\"\",\"\",VLOOKUP(C432,Vaktperioder,2,0))","v":"Natt lørdag, søndag 2200 - 2400"}]
[4,"2026-04-27","4b",{"$f":"IF(C433=\"\",\"\",VLOOKUP(C433,Vaktperioder,2,0))","v":"Natt hverdag 0000 - 0600"}]
[4,"2026-04-27","2a",{"$f":"IF(C434=\"\",\"\",VLOOKUP(C434,Vaktperioder,2,0))","v":"Hverdag, morgen 0600 - 0800"}]
[4,"2026-04-27","1a",{"$f":"IF(C435=\"\",\"\",VLOOKUP(C435,Vaktperioder,2,0))","v":"Hverdag, kveld 1600 - 2200"}]
[4,"2026-04-27","4a",{"$f":"IF(C436=\"\",\"\",VLOOKUP(C436,Vaktperioder,2,0))","v":"Natt hverdag 2200 - 2400"}]
[4,"2026-04-28","4b",{"$f":"IF(C437=\"\",\"\",VLOOKUP(C437,Vaktperioder,2,0))","v":"Natt hverdag 0000 - 0600"}]
[4,"2026-04-28","2a",{"$f":"IF(C438=\"\",\"\",VLOOKUP(C438,Vaktperioder,2,0))","v":"Hverdag, morgen 0600 - 0800"}]
[4,"2026-04-28","1a",{"$f":"IF(C439=\"\",\"\",VLOOKUP(C439,Vaktperioder,2,0))","v":"Hverdag, kveld 1600 - 2200"}]
[4,"2026-04-28","4a",{"$f":"IF(C440=\"\",\"\",VLOOKUP(C440,Vaktperioder,2,0))","v":"Natt hverdag 2200 - 2400"}]
[4,"2026-04-29","4b",{"$f":"IF(C441=\"\",\"\",VLOOKUP(C441,Vaktperioder,2,0))","v":"Natt hverdag 0000 - 0600"}]
[4,"2026-04-29","2a",{"$f":"IF(C442=\"\",\"\",VLOOKUP(C442,Vaktperioder,2,0))","v":"Hverdag, morgen 0600 - 0800"}]
[4,"2026-04-29","1a",{"$f":"IF(C443=\"\",\"\",VLOOKUP(C443,Vaktperioder,2,0))","v":"Hverdag, kveld 1600 - 2200"}]
[4,"2026-04-29","4a",{"$f":"IF(C444=\"\",\"\",VLOOKUP(C444,Vaktperioder,2,0))","v":"Natt hverdag 2200 - 2400"}]
[4,"2026-04-30","4b",{"$f":"IF(C445=\"\",\"\",VLOOKUP(C445,Vaktperioder,2,0))","v":"Natt hverdag 0000 - 0600"}]
[4,"2026-04-30","2a",{"$f":"IF(C446=\"\",\"\",VLOOKUP(C446,Vaktperioder,2,0))","v":"Hverdag, morgen 0600 - 0800"}]
[4,"2026-04-30","1a",{"$f":"IF(C447=\"\",\"\",VLOOKUP(C447,Vaktperioder,2,0))","v":"Hverdag, kveld 1600 - 2200"}]
[4,"2026-04-30","4a",{"$f":"IF(C448=\"\",\"\",VLOOKUP(C448,Vaktperioder,2,0))","v":"Natt hverdag 2200 - 2400"}]
[5,"2026-05-01","4f","Natt hellig- og høytidsdag 0000 - 0600"]
[5,"2026-05-01","3b","Hellig- og høytidsdag 0600 - 2200"]
[5,"2026-05-01","4e",{"$f":"IF(C451=\"\",\"\",VLOOKUP(C451,Vaktperioder,2,0))","v":"Natt hellig- og høytidsdag 2200 - 2400"}]
[{"$f":"IF(B452=\"\",\"\",MONTH(B452))","v":5},"2026-05-02","4d","Natt lørdag, søndag 0000 - 0600"]
[5,"2026-05-02","3a","Lørdag, søndag 0600 - 2200",null,null,null,null,null,null,{"$f":"IF(C452=\"3d\",IF(C453=\"4e\",0,1),0)","v":0}]
[5,"2026-05-02","4c","Natt lørdag, søndag 2200 - 2400",null,null,null,null,null,null,{"$f":"IF(C453=\"3d\",IF(C454=\"4e\",0,1),0)","v":0}]
[5,"2026-05-03","4d","Natt lørdag, søndag 0000 - 0600",null,null,null,null,null,null,{"$f":"IF(C454=\"3d\",IF(C455=\"4e\",0,1),0)","v":0}]
[5,"2026-05-03","3a","Lørdag, søndag 0600 - 2200",null,null,null,null,null,null,{"$f":"IF(C455=\"3d\",IF(C456=\"4e\",0,1),0)","v":0}]
[5,"2026-05-03","4c","Natt lørdag, søndag 2200 - 2400",null,null,null,null,null,null,0]
[5,"2026-05-04","4b","Natt hverdag 0000 - 0600",null,null,null,null,null,null,0]
[5,"2026-05-04","2a","Hverdag, morgen 0600 - 0800",null,null,null,null,null,null,0]
[5,"2026-05-04","1a","Hverdag, kveld 1600 - 2200",null,null,null,null,null,null,0]
[5,"2026-05-04","4a","Natt hverdag 2200 - 2400",null,null,null,null,null,null,0]
[5,"2026-05-05","4b","Natt hverdag 0000 - 0600",null,null,null,null,null,null,0]
[5,"2026-05-05","2a","Hverdag, morgen 0600 - 0800",null,null,null,null,null,null,0]
[5,"2026-05-05","1a","Hverdag, kveld 1600 - 2200",null,null,null,null,null,null,0]
[5,"2026-05-05","4a","Natt hverdag 2200 - 2400",null,null,null,null,null,null,0]
[5,"2026-05-06","4b","Natt hverdag 0000 - 0600",null,null,null,null,null,null,0]
[5,"2026-05-06","2a","Hverdag, morgen 0600 - 0800",null,null,null,null,null,null,0]
[5,"2026-05-06","1a","Hverdag, kveld 1600 - 2200",null,null,null,null,null,null,0]
[5,"2026-05-06","4a","Natt hverdag 2200 - 2400",null,null,null,null,null,null,0]
[5,"2026-05-07","4b","Natt hverdag 0000 - 0600",null,null,null,null,null,null,0]
[5,"2026-05-07","2a","Hverdag, morgen 0600 - 0800",null,null,null,null,null,null,0]
[5,"2026-05-07","1a","Hverdag, kveld 1600 - 2200",null,null,null,null,null,null,0]
[5,"2026-05-07","4a","Natt hverdag 2200 - 2400",null,null,null,null,null,null,0]
[5,"2026-05-08","4b","Natt hverdag 0000 - 0600",null,null,null,null,null,null,0]
[5,"2026-05-08","2a","Hverdag, morgen 0600 - 0800",null,null,null,null,null,null,0]
[5,"2026-05-08","1a","Hverdag, kveld 1600 - 2200",null,null,null,null,null,null,0]
[5,"2026-05-08","4a","Natt hverdag 2200 - 2400",null,null,null,null,null,null,0]
[5,"2026-05-09","4d","Natt lørdag, søndag 0000 - 0600",null,null,null,null,null,null,0]
[5,"2026-05-09","3a","Lørdag, søndag 0600 - 2200",null,null,null,null,null,null,0]
[5,"2026-05-09","4c","Natt lørdag, søndag 2200 - 2400",null,null,null,null,null,null,0]
[5,"2026-05-10","4d","Natt lørdag, søndag 0000 - 0600",null,null,null,null,null,null,0]
[5,"2026-05-10","3a","Lørdag, søndag 0600 - 2200",null,null,null,null,null,null,0]
[5,"2026-05-10","4c","Natt lørdag, søndag 2200 - 2400",null,null,null,null,null,null,0]
[5,"2026-05-11","4b","Natt hverdag 0000 - 0600",null,null,null,null,null,null,0]
[5,"2026-05-11","2a","Hverdag, morgen 0600 - 0800",null,null,null,null,null,null,0]
[5,"2026-05-11","1a","Hverdag, kveld 1600 - 2200",null,null,null,null,null,null,0]
[5,"2026-05-11","4a","Natt hverdag 2200 - 2400",null,null,null,null,null,null,0]
[5,"2026-05-12","4b","Natt hverdag 0000 - 0600",null,null,null,null,null,null,0]
[5,"2026-05-12","2a","Hverdag, morgen 0600 - 0800",null,null,null,null,null,null,0]
[5,"2026-05-12","1a","Hverdag, kveld 1600 - 2200",null,null,null,null,null,null,0]
[5,"2026-05-12","4a","Natt hverdag 2200 - 2400",null,null,null,null,null,null,0]
[5,"2026-05-13","4b","Natt hverdag 0000 - 0600",null,null,null,null,null,null,0]
[5,"2026-05-13","2a","Hverdag, morgen 0600 - 0800",null,null,null,null,null,null,0]
[5,"2026-05-13","1a","Hverdag, kveld 1600 - 2200",null,null,null,null,null,null,0]
[5,"2026-05-13","4a","Natt hverdag 2200 - 2400",null,null,null,null,null,null,0]
[5,"2026-05-14","4f","Natt hellig- og høytidsdag 0000 - 0600",null,null,null,null,null,null,0]
[5,"2026-05-14","3b","Hellig- og høytidsdag 0600 - 2200",null,null,null,null,null,null,0]
[5,"2026-05-14","4e","Natt hellig- og høytidsdag 2200 - 2400",null,null,null,null,null,null,0]
[5,"2026-05-15","4b","Natt hverdag 0000 - 0600",null,null,null,null,null,null,0]
[5,"2026-05-15","2a","Hverdag, morgen 0600 - 0800",null,null,null,null,null,null,0]
[5,"2026-05-15","1a","Hverdag, kveld 1600 - 2200",null,null,null,null,null,null,0]
[5,"2026-05-15","4a","Natt hverdag 2200 - 2400",null,null,null,null,null,null,0]
[5,"2026-05-16","4d","Natt lørdag, søndag 0000 - 0600",null,null,null,null,null,null,0]
[5,"2026-05-16","3a","Lørdag, søndag 0600 - 2200",null,null,null,null,null,null,0]
[5,"2026-05-16","4c","Natt lørdag, søndag 2200 - 2400",null,null,null,null,null,null,0]
[5,"2026-05-17","4f","Natt hellig- og høytidsdag 0000 - 0600",null,null,null,null,null,null,0]
[5,"2026-05-17","3b","Hellig- og høytidsdag 0600 - 2200",null,null,null,null,null,null,0]
[5,"2026-05-17","4e","Natt hellig- og høytidsdag 2200 - 2400",null,null,null,null,null,null,0]
[5,"2026-05-18","4b","Natt hverdag 0000 - 0600",null,null,null,null,null,null,0]
[5,"2026-05-18","2a","Hverdag, morgen 0600 - 0800",null,null,null,null,null,null,0]
[5,"2026-05-18","1a","Hverdag, kveld 1600 - 2200",null,null,null,null,null,null,0]
[5,"2026-05-18","4a","Natt hverdag 2200 - 2400",null,null,null,null,null,null,0]
[5,"2026-05-19","4b","Natt hverdag 0000 - 0600",null,null,null,null,null,null,0]
[5,"2026-05-19","2a","Hverdag, morgen 0600 - 0800",null,null,null,null,null,null,0]
[5,"2026-05-19","1a",{"$f":"IF(C515=\"\",\"\",VLOOKUP(C515,Vaktperioder,2,0))","v":"Hverdag, kveld 1600 - 2200"},null,null,null,null,null,null,0]
[{"$f":"IF(B516=\"\",\"\",MONTH(B516))","v":5},"2026-05-19","4a","Natt hverdag 2200 - 2400",null,null,null,null,null,null,0]
[5,"2026-05-20","4b","Natt hverdag 0000 - 0600",null,null,null,null,null,null,0]
[5,"2026-05-20","2a","Hverdag, morgen 0600 - 0800",null,null,null,null,null,null,0]
[5,"2026-05-20","1a","Hverdag, kveld 1600 - 2200",null,null,null,null,null,null,0]
[5,"2026-05-20","4a","Natt hverdag 2200 - 2400",null,null,null,null,null,null,{"$f":"IF(C519=\"3d\",IF(C520=\"4e\",0,1),0)","v":0}]
[5,"2026-05-21","4b","Natt hverdag 0000 - 0600",null,null,null,null,null,null,0]
[5,"2026-05-21","2a","Hverdag, morgen 0600 - 0800",null,null,null,null,null,null,0]
[5,"2026-05-21","1a","Hverdag, kveld 1600 - 2200",null,null,null,null,null,null,0]
[5,"2026-05-21","4a","Natt hverdag 2200 - 2400",null,null,null,null,null,null,0]
[5,"2026-05-22","4b","Natt hverdag 0000 - 0600",null,null,null,null,null,null,0]
[5,"2026-05-22","2a","Hverdag, morgen 0600 - 0800",null,null,null,null,null,null,0]
[5,"2026-05-22","1a","Hverdag, kveld 1600 - 2200",null,null,null,null,null,null,0]
[5,"2026-05-22","4a","Natt hverdag 2200 - 2400",null,null,null,null,null,null,0]
[5,"2026-05-23","4d","Natt lørdag, søndag 0000 - 0600",null,null,null,null,null,null,0]
[5,"2026-05-23","3a","Lørdag, søndag 0600 - 2200",null,null,null,null,null,null,0]
[5,"2026-05-23","4c","Natt lørdag, søndag 2200 - 2400",null,null,null,null,null,null,0]
[5,"2026-05-24","4f","Natt hellig- og høytidsdag 0000 - 0600",null,null,null,null,null,null,0]
[5,"2026-05-24","3b","Hellig- og høytidsdag 0600 - 2200",null,null,null,null,null,null,0]
[5,"2026-05-24","4e","Natt hellig- og høytidsdag 2200 - 2400",null,null,null,null,null,null,0]
[5,"2026-05-25","4f","Natt hellig- og høytidsdag 0000 - 0600",null,null,null,null,null,null,0]
[5,"2026-05-25","3b","Hellig- og høytidsdag 0600 - 2200",null,null,null,null,null,null,0]
[5,"2026-05-25","4e","Natt hellig- og høytidsdag 2200 - 2400",null,null,null,null,null,null,0]
[5,"2026-05-26","4b","Natt hverdag 0000 - 0600",null,null,null,null,null,null,0]
[5,"2026-05-26","2a","Hverdag, morgen 0600 - 0800",null,null,null,null,null,null,0]
[5,"2026-05-26","1a","Hverdag, kveld 1600 - 2200",null,null,null,null,null,null,0]
[5,"2026-05-26","4a","Natt hverdag 2200 - 2400",null,null,null,null,null,null,0]
[5,"2026-05-27","4b","Natt hverdag 0000 - 0600",null,null,null,null,null,null,0]
[5,"2026-05-27","2a","Hverdag, morgen 0600 - 0800",null,null,null,null,null,null,0]
[5,"2026-05-27","1a","Hverdag, kveld 1600 - 2200",null,null,null,null,null,null,0]
[5,"2026-05-27","4a","Natt hverdag 2200 - 2400",null,null,null,null,null,null,0]
[5,"2026-05-28","4b","Natt hverdag 0000 - 0600",null,null,null,null,null,null,0]
[5,"2026-05-28","2a","Hverdag, morgen 0600 - 0800",null,null,null,null,null,null,0]
[5,"2026-05-28","1a","Hverdag, kveld 1600 - 2200",null,null,null,null,null,null,0]
[5,"2026-05-28","4a","Natt hverdag 2200 - 2400",null,null,null,null,null,null,0]
[5,"2026-05-29","4b","Natt hverdag 0000 - 0600",null,null,null,null,null,null,0]
[5,"2026-05-29","2a","Hverdag, morgen 0600 - 0800",null,null,null,null,null,null,0]
[5,"2026-05-29","1a","Hverdag, kveld 1600 - 2200",null,null,null,null,null,null,0]
[5,"2026-05-29","4a","Natt hverdag 2200 - 2400",null,null,null,null,null,null,0]
[5,"2026-05-30","4d","Natt lørdag, søndag 0000 - 0600",null,null,null,null,null,null,0]
[5,"2026-05-30","3a","Lørdag, søndag 0600 - 2200",null,null,null,null,null,null,0]
[5,"2026-05-30","4c","Natt lørdag, søndag 2200 - 2400",null,null,null,null,null,null,0]
[5,"2026-05-31","4d","Natt lørdag, søndag 0000 - 0600",null,null,null,null,null,null,0]
[5,"2026-05-31","3a","Lørdag, søndag 0600 - 2200",null,null,null,null,null,null,0]
[5,"2026-05-31","4c","Natt lørdag, søndag 2200 - 2400",null,null,null,null,null,null,0]
[6,"2026-06-01","4b","Natt hverdag 0000 - 0600",null,null,null,null,null,null,0]
[6,"2026-06-01","2a","Hverdag, morgen 0600 - 0800",null,null,null,null,null,null,0]
[6,"2026-06-01","1a",{"$f":"IF(C562=\"\",\"\",VLOOKUP(C562,Vaktperioder,2,0))","v":"Hverdag, kveld 1600 - 2200"},null,null,null,null,null,null,0]
[6,"2026-06-01","4a","Natt hverdag 2200 - 2400",null,null,null,null,null,null,0]
[6,"2026-06-02","4b","Natt hverdag 0000 - 0600",null,null,null,null,null,null,0]
[6,"2026-06-02","2a","Hverdag, morgen 0600 - 0800",null,null,null,null,null,null,0]
[6,"2026-06-02","1a","Hverdag, kveld 1600 - 2200",null,null,null,null,null,null,0]
[6,"2026-06-02","4a","Natt hverdag 2200 - 2400",null,null,null,null,null,null,0]
[6,"2026-06-03","4b","Natt hverdag 0000 - 0600",null,null,null,null,null,null,0]
[6,"2026-06-03","2a","Hverdag, morgen 0600 - 0800",null,null,null,null,null,null,0]
[6,"2026-06-03","1a","Hverdag, kveld 1600 - 2200",null,null,null,null,null,null,0]
[6,"2026-06-03","4a","Natt hverdag 2200 - 2400",null,null,null,null,null,null,0]
[6,"2026-06-04","4b","Natt hverdag 0000 - 0600",null,null,null,null,null,null,0]
[6,"2026-06-04","2a","Hverdag, morgen 0600 - 0800",null,null,null,null,null,null,0]
[6,"2026-06-04","1a","Hverdag, kveld 1600 - 2200",null,null,null,null,null,null,0]
[6,"2026-06-04","4a","Natt hverdag 2200 - 2400",null,null,null,null,null,null,0]
[6,"2026-06-05","4b","Natt hverdag 0000 - 0600",null,null,null,null,null,null,0]
[6,"2026-06-05","2a","Hverdag, morgen 0600 - 0800",null,null,null,null,null,null,0]
[6,"2026-06-05","1a","Hverdag, kveld 1600 - 2200",null,null,null,null,null,null,0]
[6,"2026-06-05","4a",{"$f":"IF(C579=\"\",\"\",VLOOKUP(C579,Vaktperioder,2,0))","v":"Natt hverdag 2200 - 2400"},null,null,null,null,null,null,0]
[{"$f":"IF(B580=\"\",\"\",MONTH(B580))","v":6},"2026-06-06","4d","Natt lørdag, søndag 0000 - 0600",null,null,null,null,null,null,0]
[6,"2026-06-06","3a","Lørdag, søndag 0600 - 2200",null,null,null,null,null,null,0]
[6,"2026-06-06","4c","Natt lørdag, søndag 2200 - 2400",null,null,null,null,null,null,0]
[6,"2026-06-07","4d","Natt lørdag, søndag 0000 - 0600",null,null,null,null,null,null,0]
[6,"2026-06-07","3a","Lørdag, søndag 0600 - 2200",null,null,null,null,null,null,{"$f":"IF(C583=\"3d\",IF(C584=\"4e\",0,1),0)","v":0}]
[6,"2026-06-07","4c","Natt lørdag, søndag 2200 - 2400",null,null,null,null,null,null,0]
[6,"2026-06-08","4b","Natt hverdag 0000 - 0600",null,null,null,null,null,null,0]
[6,"2026-06-08","2a","Hverdag, morgen 0600 - 0800",null,null,null,null,null,null,0]
[6,"2026-06-08","1a","Hverdag, kveld 1600 - 2200",null,null,null,null,null,null,0]
[6,"2026-06-08","4a","Natt hverdag 2200 - 2400",null,null,null,null,null,null,0]
[6,"2026-06-09","4b","Natt hverdag 0000 - 0600",null,null,null,null,null,null,0]
[6,"2026-06-09","2a","Hverdag, morgen 0600 - 0800",null,null,null,null,null,null,0]
[6,"2026-06-09","1a","Hverdag, kveld 1600 - 2200",null,null,null,null,null,null,0]
[6,"2026-06-09","4a","Natt hverdag 2200 - 2400",null,null,null,null,null,null,0]
[6,"2026-06-10","4b","Natt hverdag 0000 - 0600",null,null,null,null,null,null,0]
[6,"2026-06-10","2a","Hverdag, morgen 0600 - 0800",null,null,null,null,null,null,0]
[6,"2026-06-10","1a","Hverdag, kveld 1600 - 2200",null,null,null,null,null,null,0]
[6,"2026-06-10","4a","Natt hverdag 2200 - 2400",null,null,null,null,null,null,0]
[6,"2026-06-11","4b","Natt hverdag 0000 - 0600",null,null,null,null,null,null,0]
[6,"2026-06-11","2a","Hverdag, morgen 0600 - 0800",null,null,null,null,null,null,0]
[6,"2026-06-11","1a","Hverdag, kveld 1600 - 2200",null,null,null,null,null,null,0]
[6,"2026-06-11","4a","Natt hverdag 2200 - 2400",null,null,null,null,null,null,0]
[6,"2026-06-12","4b","Natt hverdag 0000 - 0600",null,null,null,null,null,null,0]
[6,"2026-06-12","2a","Hverdag, morgen 0600 - 0800",null,null,null,null,null,null,0]
[6,"2026-06-12","1a","Hverdag, kveld 1600 - 2200",null,null,null,null,null,null,0]
[6,"2026-06-12","4a","Natt hverdag 2200 - 2400",null,null,null,null,null,null,0]
[6,"2026-06-13","4d","Natt lørdag, søndag 0000 - 0600",null,null,null,null,null,null,0]
[6,"2026-06-13","3a","Lørdag, søndag 0600 - 2200",null,null,null,null,null,null,0]
[6,"2026-06-13","4c","Natt lørdag, søndag 2200 - 2400",null,null,null,null,null,null,0]
[6,"2026-06-14","4d","Natt lørdag, søndag 0000 - 0600",null,null,null,null,null,null,{"$f":"IF(#REF!=\"3d\",IF(C609=\"4e\",0,1),0)","v":{"$error":"#REF!"}}]
[6,"2026-06-14","3a","Lørdag, søndag 0600 - 2200",null,null,null,null,null,null,0]
[6,"2026-06-14","4c","Natt lørdag, søndag 2200 - 2400",null,null,null,null,null,null,0]
[6,"2026-06-15","4b","Natt hverdag 0000 - 0600",null,null,null,null,null,null,0]
[6,"2026-06-15","2a","Hverdag, morgen 0600 - 0800",null,null,null,null,null,null,0]
[6,"2026-06-15","1a","Hverdag, kveld 1600 - 2200",null,null,null,null,null,null,0]
[6,"2026-06-15","4a","Natt hverdag 2200 - 2400",null,null,null,null,null,null,0]
[6,"2026-06-16","4b","Natt hverdag 0000 - 0600",null,null,null,null,null,null,0]
[6,"2026-06-16","2a","Hverdag, morgen 0600 - 0800",null,null,null,null,null,null,0]
[6,"2026-06-16","1a","Hverdag, kveld 1600 - 2200",null,null,null,null,null,null,0]
[6,"2026-06-16","4a","Natt hverdag 2200 - 2400",null,null,null,null,null,null,0]
[6,"2026-06-17","4b","Natt hverdag 0000 - 0600",null,null,null,null,null,null,0]
[6,"2026-06-17","2a","Hverdag, morgen 0600 - 0800",null,null,null,null,null,null,0]
[6,"2026-06-17","1a","Hverdag, kveld 1600 - 2200",null,null,null,null,null,null,0]
[6,"2026-06-17","4a","Natt hverdag 2200 - 2400",null,null,null,null,null,null,0]
[6,"2026-06-18","4b","Natt hverdag 0000 - 0600",null,null,null,null,null,null,0]
[6,"2026-06-18","2a","Hverdag, morgen 0600 - 0800",null,null,null,null,null,null,0]
[6,"2026-06-18","1a","Hverdag, kveld 1600 - 2200",null,null,null,null,null,null,0]
[6,"2026-06-18","4a","Natt hverdag 2200 - 2400",null,null,null,null,null,null,0]
[6,"2026-06-19","4b","Natt hverdag 0000 - 0600",null,null,null,null,null,null,0]
[6,"2026-06-19","2a","Hverdag, morgen 0600 - 0800",null,null,null,null,null,null,0]
[6,"2026-06-19","1a","Hverdag, kveld 1600 - 2200",null,null,null,null,null,null,0]
[6,"2026-06-19","4a","Natt hverdag 2200 - 2400",null,null,null,null,null,null,0]
[6,"2026-06-20","4d","Natt lørdag, søndag 0000 - 0600",null,null,null,null,null,null,0]
[6,"2026-06-20","3a","Lørdag, søndag 0600 - 2200",null,null,null,null,null,null,0]
[6,"2026-06-20","4c","Natt lørdag, søndag 2200 - 2400",null,null,null,null,null,null,0]
[6,"2026-06-21","4d","Natt lørdag, søndag 0000 - 0600",null,null,null,null,null,null,0]
[6,"2026-06-21","3a","Lørdag, søndag 0600 - 2200",null,null,null,null,null,null,0]
[6,"2026-06-21","4c","Natt lørdag, søndag 2200 - 2400",null,null,null,null,null,null,0]
[6,"2026-06-22","4b","Natt hverdag 0000 - 0600",null,null,null,null,null,null,0]
[6,"2026-06-22","2a","Hverdag, morgen 0600 - 0800",null,null,null,null,null,null,0]
[6,"2026-06-22","1a","Hverdag, kveld 1600 - 2200",null,null,null,null,null,null,0]
[6,"2026-06-22","4a","Natt hverdag 2200 - 2400",null,null,null,null,null,null,0]
[6,"2026-06-23","4b",{"$f":"IF(C642=\"\",\"\",VLOOKUP(C642,Vaktperioder,2,0))","v":"Natt hverdag 0000 - 0600"},null,null,null,null,null,null,0]
[{"$f":"IF(B643=\"\",\"\",MONTH(B643))","v":6},"2026-06-23","2a","Hverdag, morgen 0600 - 0800",null,null,null,null,null,null,0]
[6,"2026-06-23","1a","Hverdag, kveld 1600 - 2200",null,null,null,null,null,null,0]
[6,"2026-06-23","4a","Natt hverdag 2200 - 2400",null,null,null,null,null,null,0]
[6,"2026-06-24","4b","Natt hverdag 0000 - 0600",null,null,null,null,null,null,0]
[6,"2026-06-24","2a","Hverdag, morgen 0600 - 0800",null,null,null,null,null,null,{"$f":"IF(C646=\"3d\",IF(C647=\"4e\",0,1),0)","v":0}]
[6,"2026-06-24","1a","Hverdag, kveld 1600 - 2200",null,null,null,null,null,null,0]
[6,"2026-06-24","4a","Natt hverdag 2200 - 2400",null,null,null,null,null,null,0]
[6,"2026-06-25","4b","Natt hverdag 0000 - 0600",null,null,null,null,null,null,0]
[6,"2026-06-25","2a","Hverdag, morgen 0600 - 0800",null,null,null,null,null,null,0]
[6,"2026-06-25","1a","Hverdag, kveld 1600 - 2200",null,null,null,null,null,null,0]
[6,"2026-06-25","4a","Natt hverdag 2200 - 2400",null,null,null,null,null,null,0]
[6,"2026-06-26","4b","Natt hverdag 0000 - 0600",null,null,null,null,null,null,0]
[6,"2026-06-26","2a","Hverdag, morgen 0600 - 0800",null,null,null,null,null,null,0]
[6,"2026-06-26","1a","Hverdag, kveld 1600 - 2200",null,null,null,null,null,null,0]
[6,"2026-06-26","4a","Natt hverdag 2200 - 2400",null,null,null,null,null,null,0]
[6,"2026-06-27","4d","Natt lørdag, søndag 0000 - 0600",null,null,null,null,null,null,0]
[6,"2026-06-27","3a","Lørdag, søndag 0600 - 2200",null,null,null,null,null,null,0]
[6,"2026-06-27","4c","Natt lørdag, søndag 2200 - 2400",null,null,null,null,null,null,0]
[6,"2026-06-28","4d","Natt lørdag, søndag 0000 - 0600",null,null,null,null,null,null,0]
[6,"2026-06-28","3a","Lørdag, søndag 0600 - 2200",null,null,null,null,null,null,0]
[6,"2026-06-28","4c","Natt lørdag, søndag 2200 - 2400",null,null,null,null,null,null,0]
[6,"2026-06-29","4b","Natt hverdag 0000 - 0600",null,null,null,null,null,null,0]
[6,"2026-06-29","2a","Hverdag, morgen 0600 - 0800",null,null,null,null,null,null,0]
[6,"2026-06-29","1a","Hverdag, kveld 1600 - 2200",null,null,null,null,null,null,0]
[6,"2026-06-29","4a","Natt hverdag 2200 - 2400",null,null,null,null,null,null,0]
[6,"2026-06-30","4b","Natt hverdag 0000 - 0600",null,null,null,null,null,null,0]
[6,"2026-06-30","2a","Hverdag, morgen 0600 - 0800",null,null,null,null,null,null,0]
[6,"2026-06-30","1a","Hverdag, kveld 1600 - 2200",null,null,null,null,null,null,0]
[6,"2026-06-30","4a","Natt hverdag 2200 - 2400",null,null,null,null,null,null,0]
[7,"2026-07-01","4b","Natt hverdag 0000 - 0600",null,null,null,null,null,null,0]
[7,"2026-07-01","2a","Hverdag, morgen 0600 - 0800",null,null,null,null,null,null,0]
[7,"2026-07-01","1a","Hverdag, kveld 1600 - 2200",null,null,null,null,null,null,0]
[7,"2026-07-01","4a","Natt hverdag 2200 - 2400",null,null,null,null,null,null,0]
[7,"2026-07-02","4b","Natt hverdag 0000 - 0600",null,null,null,null,null,null,0]
[7,"2026-07-02","2a","Hverdag, morgen 0600 - 0800",null,null,null,null,null,null,0]
[7,"2026-07-02","1a","Hverdag, kveld 1600 - 2200",null,null,null,null,null,null,0]
[7,"2026-07-02","4a","Natt hverdag 2200 - 2400",null,null,null,null,null,null,0]
[7,"2026-07-03","4b","Natt hverdag 0000 - 0600",null,null,null,null,null,null,0]
[7,"2026-07-03","2a","Hverdag, morgen 0600 - 0800",null,null,null,null,null,null,0]
[7,"2026-07-03","1a","Hverdag, kveld 1600 - 2200",null,null,null,null,null,null,0]
[7,"2026-07-03","4a","Natt hverdag 2200 - 2400",null,null,null,null,null,null,0]
[7,"2026-07-04","4d","Natt lørdag, søndag 0000 - 0600",null,null,null,null,null,null,0]
[7,"2026-07-04","3a","Lørdag, søndag 0600 - 2200",null,null,null,null,null,null,0]
[7,"2026-07-04","4c","Natt lørdag, søndag 2200 - 2400",null,null,null,null,null,null,0]
[7,"2026-07-05","4d","Natt lørdag, søndag 0000 - 0600",null,null,null,null,null,null,0]
[7,"2026-07-05","3a","Lørdag, søndag 0600 - 2200",null,null,null,null,null,null,0]
[7,"2026-07-05","4c","Natt lørdag, søndag 2200 - 2400",null,null,null,null,null,null,0]
[7,"2026-07-06","4b","Natt hverdag 0000 - 0600",null,null,null,null,null,null,0]
[7,"2026-07-06","2a","Hverdag, morgen 0600 - 0800",null,null,null,null,null,null,0]
[7,"2026-07-06","1a","Hverdag, kveld 1600 - 2200",null,null,null,null,null,null,0]
[7,"2026-07-06","4a","Natt hverdag 2200 - 2400",null,null,null,null,null,null,0]
[7,"2026-07-07","4b","Natt hverdag 0000 - 0600",null,null,null,null,null,null,0]
[7,"2026-07-07","2a","Hverdag, morgen 0600 - 0800",null,null,null,null,null,null,0]
[7,"2026-07-07","1a","Hverdag, kveld 1600 - 2200",null,null,null,null,null,null,0]
[7,"2026-07-07","4a","Natt hverdag 2200 - 2400",null,null,null,null,null,null,0]
[7,"2026-07-08","4b","Natt hverdag 0000 - 0600",null,null,null,null,null,null,0]
[7,"2026-07-08","2a","Hverdag, morgen 0600 - 0800",null,null,null,null,null,null,0]
[7,"2026-07-08","1a","Hverdag, kveld 1600 - 2200",null,null,null,null,null,null,0]
[7,"2026-07-08","4a","Natt hverdag 2200 - 2400",null,null,null,null,null,null,0]
[7,"2026-07-09","4b","Natt hverdag 0000 - 0600",null,null,null,null,null,null,0]
[7,"2026-07-09","2a","Hverdag, morgen 0600 - 0800",null,null,null,null,null,null,0]
[7,"2026-07-09","1a","Hverdag, kveld 1600 - 2200",null,null,null,null,null,null,0]
[7,"2026-07-09","4a","Natt hverdag 2200 - 2400",null,null,null,null,null,null,0]
[7,"2026-07-10","4b",{"$f":"IF(C706=\"\",\"\",VLOOKUP(C706,Vaktperioder,2,0))","v":"Natt hverdag 0000 - 0600"},null,null,null,null,null,null,0]
[{"$f":"IF(B707=\"\",\"\",MONTH(B707))","v":7},"2026-07-10","2a","Hverdag, morgen 0600 - 0800",null,null,null,null,null,null,0]
[7,"2026-07-10","1a","Hverdag, kveld 1600 - 2200",null,null,null,null,null,null,0]
[7,"2026-07-10","4a","Natt hverdag 2200 - 2400",null,null,null,null,null,null,0]
[7,"2026-07-11","4d","Natt lørdag, søndag 0000 - 0600",null,null,null,null,null,null,0]
[7,"2026-07-11","3a","Lørdag, søndag 0600 - 2200",null,null,null,null,null,null,{"$f":"IF(C710=\"3d\",IF(C711=\"4e\",0,1),0)","v":0}]
[7,"2026-07-11","4c","Natt lørdag, søndag 2200 - 2400",null,null,null,null,null,null,0]
[7,"2026-07-12","4d","Natt lørdag, søndag 0000 - 0600",null,null,null,null,null,null,0]
[7,"2026-07-12","3a","Lørdag, søndag 0600 - 2200",null,null,null,null,null,null,0]
[7,"2026-07-12","4c","Natt lørdag, søndag 2200 - 2400",null,null,null,null,null,null,0]
[7,"2026-07-13","4b","Natt hverdag 0000 - 0600",null,null,null,null,null,null,0]
[7,"2026-07-13","2a","Hverdag, morgen 0600 - 0800",null,null,null,null,null,null,0]
[7,"2026-07-13","1a","Hverdag, kveld 1600 - 2200",null,null,null,null,null,null,0]
[7,"2026-07-13","4a","Natt hverdag 2200 - 2400",null,null,null,null,null,null,0]
[7,"2026-07-14","4b","Natt hverdag 0000 - 0600",null,null,null,null,null,null,0]
[7,"2026-07-14","2a","Hverdag, morgen 0600 - 0800",null,null,null,null,null,null,0]
[7,"2026-07-14","1a","Hverdag, kveld 1600 - 2200",null,null,null,null,null,null,0]
[7,"2026-07-14","4a","Natt hverdag 2200 - 2400",null,null,null,null,null,null,0]
[7,"2026-07-15","4b","Natt hverdag 0000 - 0600",null,null,null,null,null,null,0]
[7,"2026-07-15","2a","Hverdag, morgen 0600 - 0800",null,null,null,null,null,null,0]
[7,"2026-07-15","1a","Hverdag, kveld 1600 - 2200",null,null,null,null,null,null,0]
[7,"2026-07-15","4a","Natt hverdag 2200 - 2400",null,null,null,null,null,null,0]
[7,"2026-07-16","4b","Natt hverdag 0000 - 0600",null,null,null,null,null,null,0]
[7,"2026-07-16","2a","Hverdag, morgen 0600 - 0800",null,null,null,null,null,null,0]
[7,"2026-07-16","1a","Hverdag, kveld 1600 - 2200",null,null,null,null,null,null,0]
[7,"2026-07-16","4a","Natt hverdag 2200 - 2400",null,null,null,null,null,null,0]
[7,"2026-07-17","4b","Natt hverdag 0000 - 0600",null,null,null,null,null,null,0]
[7,"2026-07-17","2a","Hverdag, morgen 0600 - 0800",null,null,null,null,null,null,0]
[7,"2026-07-17","1a","Hverdag, kveld 1600 - 2200",null,null,null,null,null,null,0]
[7,"2026-07-17","4a","Natt hverdag 2200 - 2400",null,null,null,null,null,null,0]
[7,"2026-07-18","4d","Natt lørdag, søndag 0000 - 0600",null,null,null,null,null,null,0]
[7,"2026-07-18","3a","Lørdag, søndag 0600 - 2200",null,null,null,null,null,null,0]
[7,"2026-07-18","4c","Natt lørdag, søndag 2200 - 2400",null,null,null,null,null,null,0]
[7,"2026-07-19","4d","Natt lørdag, søndag 0000 - 0600",null,null,null,null,null,null,0]
[7,"2026-07-19","3a","Lørdag, søndag 0600 - 2200",null,null,null,null,null,null,0]
[7,"2026-07-19","4c","Natt lørdag, søndag 2200 - 2400",null,null,null,null,null,null,0]
[7,"2026-07-20","4b","Natt hverdag 0000 - 0600",null,null,null,null,null,null,0]
[7,"2026-07-20","2a","Hverdag, morgen 0600 - 0800",null,null,null,null,null,null,0]
[7,"2026-07-20","1a","Hverdag, kveld 1600 - 2200",null,null,null,null,null,null,0]
[7,"2026-07-20","4a","Natt hverdag 2200 - 2400",null,null,null,null,null,null,0]
[7,"2026-07-21","4b","Natt hverdag 0000 - 0600",null,null,null,null,null,null,0]
[7,"2026-07-21","2a","Hverdag, morgen 0600 - 0800",null,null,null,null,null,null,0]
[7,"2026-07-21","1a","Hverdag, kveld 1600 - 2200",null,null,null,null,null,null,0]
[7,"2026-07-21","4a","Natt hverdag 2200 - 2400",null,null,null,null,null,null,0]
[7,"2026-07-22","4b","Natt hverdag 0000 - 0600",null,null,null,null,null,null,0]
[7,"2026-07-22","2a","Hverdag, morgen 0600 - 0800",null,null,null,null,null,null,0]
[7,"2026-07-22","1a","Hverdag, kveld 1600 - 2200",null,null,null,null,null,null,0]
[7,"2026-07-22","4a","Natt hverdag 2200 - 2400",null,null,null,null,null,null,0]
[7,"2026-07-23","4b","Natt hverdag 0000 - 0600",null,null,null,null,null,null,0]
[7,"2026-07-23","2a","Hverdag, morgen 0600 - 0800",null,null,null,null,null,null,0]
[7,"2026-07-23","1a","Hverdag, kveld 1600 - 2200",null,null,null,null,null,null,0]
[7,"2026-07-23","4a","Natt hverdag 2200 - 2400",null,null,null,null,null,null,0]
[7,"2026-07-24","4b","Natt hverdag 0000 - 0600",null,null,null,null,null,null,0]
[7,"2026-07-24","2a","Hverdag, morgen 0600 - 0800",null,null,null,null,null,null,0]
[7,"2026-07-24","1a","Hverdag, kveld 1600 - 2200",null,null,null,null,null,null,0]
[7,"2026-07-24","4a","Natt hverdag 2200 - 2400",null,null,null,null,null,null,0]
[7,"2026-07-25","4d","Natt lørdag, søndag 0000 - 0600",null,null,null,null,null,null,0]
[7,"2026-07-25","3a","Lørdag, søndag 0600 - 2200",null,null,null,null,null,null,0]
[7,"2026-07-25","4c","Natt lørdag, søndag 2200 - 2400",null,null,null,null,null,null,0]
[7,"2026-07-26","4d","Natt lørdag, søndag 0000 - 0600",null,null,null,null,null,null,0]
[7,"2026-07-26","3a","Lørdag, søndag 0600 - 2200",null,null,null,null,null,null,0]
[7,"2026-07-26","4c","Natt lørdag, søndag 2200 - 2400",null,null,null,null,null,null,0]
[7,"2026-07-27","4b","Natt hverdag 0000 - 0600",null,null,null,null,null,null,0]
[7,"2026-07-27","2a","Hverdag, morgen 0600 - 0800",null,null,null,null,null,null,0]
[7,"2026-07-27","1a",{"$f":"IF(C770=\"\",\"\",VLOOKUP(C770,Vaktperioder,2,0))","v":"Hverdag, kveld 1600 - 2200"},null,null,null,null,null,null,0]
[{"$f":"IF(B771=\"\",\"\",MONTH(B771))","v":7},"2026-07-27","4a","Natt hverdag 2200 - 2400",null,null,null,null,null,null,0]
[7,"2026-07-28","4b","Natt hverdag 0000 - 0600",null,null,null,null,null,null,0]
[7,"2026-07-28","2a","Hverdag, morgen 0600 - 0800",null,null,null,null,null,null,0]
[7,"2026-07-28","1a","Hverdag, kveld 1600 - 2200",null,null,null,null,null,null,0]
[7,"2026-07-28","4a","Natt hverdag 2200 - 2400",null,null,null,null,null,null,{"$f":"IF(C774=\"3d\",IF(C775=\"4e\",0,1),0)","v":0}]
[7,"2026-07-29","4b","Natt hverdag 0000 - 0600",null,null,null,null,null,null,0]
[7,"2026-07-29","2a","Hverdag, morgen 0600 - 0800",null,null,null,null,null,null,0]
[7,"2026-07-29","1a","Hverdag, kveld 1600 - 2200",null,null,null,null,null,null,0]
[7,"2026-07-29","4a","Natt hverdag 2200 - 2400",null,null,null,null,null,null,0]
[7,"2026-07-30","4b","Natt hverdag 0000 - 0600",null,null,null,null,null,null,0]
[7,"2026-07-30","2a","Hverdag, morgen 0600 - 0800",null,null,null,null,null,null,0]
[7,"2026-07-30","1a","Hverdag, kveld 1600 - 2200",null,null,null,null,null,null,0]
[7,"2026-07-30","4a","Natt hverdag 2200 - 2400",null,null,null,null,null,null,0]
[7,"2026-07-31","4b","Natt hverdag 0000 - 0600",null,null,null,null,null,null,0]
[7,"2026-07-31","2a","Hverdag, morgen 0600 - 0800",null,null,null,null,null,null,0]
[7,"2026-07-31","1a","Hverdag, kveld 1600 - 2200",null,null,null,null,null,null,0]
[7,"2026-07-31","4a","Natt hverdag 2200 - 2400",null,null,null,null,null,null,0]
[8,"2026-08-01","4d","Natt lørdag, søndag 0000 - 0600",null,null,null,null,null,null,0]
[8,"2026-08-01","3a","Lørdag, søndag 0600 - 2200",null,null,null,null,null,null,0]
[8,"2026-08-01","4c","Natt lørdag, søndag 2200 - 2400",null,null,null,null,null,null,0]
[8,"2026-08-02","4d","Natt lørdag, søndag 0000 - 0600",null,null,null,null,null,null,0]
[8,"2026-08-02","3a","Lørdag, søndag 0600 - 2200",null,null,null,null,null,null,0]
[8,"2026-08-02","4c","Natt lørdag, søndag 2200 - 2400",null,null,null,null,null,null,0]
[8,"2026-08-03","4b","Natt hverdag 0000 - 0600",null,null,null,null,null,null,0]
[8,"2026-08-03","2a","Hverdag, morgen 0600 - 0800",null,null,null,null,null,null,0]
[8,"2026-08-03","1a","Hverdag, kveld 1600 - 2200",null,null,null,null,null,null,0]
[8,"2026-08-03","4a","Natt hverdag 2200 - 2400",null,null,null,null,null,null,0]
[8,"2026-08-04","4b","Natt hverdag 0000 - 0600",null,null,null,null,null,null,0]
[8,"2026-08-04","2a","Hverdag, morgen 0600 - 0800",null,null,null,null,null,null,0]
[8,"2026-08-04","1a","Hverdag, kveld 1600 - 2200",null,null,null,null,null,null,0]
[8,"2026-08-04","4a","Natt hverdag 2200 - 2400",null,null,null,null,null,null,0]
[8,"2026-08-05","4b","Natt hverdag 0000 - 0600",null,null,null,null,null,null,0]
[8,"2026-08-05","2a","Hverdag, morgen 0600 - 0800",null,null,null,null,null,null,0]
[8,"2026-08-05","1a","Hverdag, kveld 1600 - 2200",null,null,null,null,null,null,0]
[8,"2026-08-05","4a","Natt hverdag 2200 - 2400",null,null,null,null,null,null,0]
[8,"2026-08-06","4b","Natt hverdag 0000 - 0600",null,null,null,null,null,null,0]
[8,"2026-08-06","2a","Hverdag, morgen 0600 - 0800",null,null,null,null,null,null,0]
[8,"2026-08-06","1a","Hverdag, kveld 1600 - 2200",null,null,null,null,null,null,0]
[8,"2026-08-06","4a","Natt hverdag 2200 - 2400",null,null,null,null,null,null,0]
[8,"2026-08-07","4b","Natt hverdag 0000 - 0600",null,null,null,null,null,null,0]
[8,"2026-08-07","2a","Hverdag, morgen 0600 - 0800",null,null,null,null,null,null,0]
[8,"2026-08-07","1a","Hverdag, kveld 1600 - 2200",null,null,null,null,null,null,0]
[8,"2026-08-07","4a","Natt hverdag 2200 - 2400",null,null,null,null,null,null,0]
[8,"2026-08-08","4d","Natt lørdag, søndag 0000 - 0600",null,null,null,null,null,null,0]
[8,"2026-08-08","3a","Lørdag, søndag 0600 - 2200",null,null,null,null,null,null,0]
[8,"2026-08-08","4c","Natt lørdag, søndag 2200 - 2400",null,null,null,null,null,null,0]
[8,"2026-08-09","4d","Natt lørdag, søndag 0000 - 0600",null,null,null,null,null,null,0]
[8,"2026-08-09","3a","Lørdag, søndag 0600 - 2200",null,null,null,null,null,null,0]
[8,"2026-08-09","4c","Natt lørdag, søndag 2200 - 2400",null,null,null,null,null,null,0]
[8,"2026-08-10","4b","Natt hverdag 0000 - 0600",null,null,null,null,null,null,0]
[8,"2026-08-10","2a","Hverdag, morgen 0600 - 0800",null,null,null,null,null,null,0]
[8,"2026-08-10","1a","Hverdag, kveld 1600 - 2200",null,null,null,null,null,null,0]
[8,"2026-08-10","4a","Natt hverdag 2200 - 2400",null,null,null,null,null,null,0]
[8,"2026-08-11","4b","Natt hverdag 0000 - 0600",null,null,null,null,null,null,0]
[8,"2026-08-11","2a","Hverdag, morgen 0600 - 0800",null,null,null,null,null,null,0]
[8,"2026-08-11","1a","Hverdag, kveld 1600 - 2200",null,null,null,null,null,null,0]
[8,"2026-08-11","4a","Natt hverdag 2200 - 2400",null,null,null,null,null,null,0]
[8,"2026-08-12","4b","Natt hverdag 0000 - 0600",null,null,null,null,null,null,0]
[8,"2026-08-12","2a","Hverdag, morgen 0600 - 0800",null,null,null,null,null,null,0]
[8,"2026-08-12","1a","Hverdag, kveld 1600 - 2200",null,null,null,null,null,null,0]
[8,"2026-08-12","4a","Natt hverdag 2200 - 2400",null,null,null,null,null,null,0]
[8,"2026-08-13","4b","Natt hverdag 0000 - 0600",null,null,null,null,null,null,0]
[8,"2026-08-13","2a","Hverdag, morgen 0600 - 0800",null,null,null,null,null,null,0]
[8,"2026-08-13","1a",{"$f":"IF(C834=\"\",\"\",VLOOKUP(C834,Vaktperioder,2,0))","v":"Hverdag, kveld 1600 - 2200"},null,null,null,null,null,null,0]
[{"$f":"IF(B835=\"\",\"\",MONTH(B835))","v":8},"2026-08-13","4a","Natt hverdag 2200 - 2400",null,null,null,null,null,null,0]
[8,"2026-08-14","4b","Natt hverdag 0000 - 0600",null,null,null,null,null,null,0]
[8,"2026-08-14","2a","Hverdag, morgen 0600 - 0800",null,null,null,null,null,null,0]
[8,"2026-08-14","1a","Hverdag, kveld 1600 - 2200",null,null,null,null,null,null,0]
[8,"2026-08-14","4a","Natt hverdag 2200 - 2400",null,null,null,null,null,null,{"$f":"IF(C838=\"3d\",IF(C839=\"4e\",0,1),0)","v":0}]
[8,"2026-08-15","4d","Natt lørdag, søndag 0000 - 0600",null,null,null,null,null,null,0]
[8,"2026-08-15","3a","Lørdag, søndag 0600 - 2200",null,null,null,null,null,null,0]
[8,"2026-08-15","4c","Natt lørdag, søndag 2200 - 2400",null,null,null,null,null,null,0]
[8,"2026-08-16","4d","Natt lørdag, søndag 0000 - 0600",null,null,null,null,null,null,0]
[8,"2026-08-16","3a","Lørdag, søndag 0600 - 2200",null,null,null,null,null,null,0]
[8,"2026-08-16","4c","Natt lørdag, søndag 2200 - 2400",null,null,null,null,null,null,0]
[8,"2026-08-17","4b","Natt hverdag 0000 - 0600",null,null,null,null,null,null,0]
[8,"2026-08-17","2a","Hverdag, morgen 0600 - 0800",null,null,null,null,null,null,0]
[8,"2026-08-17","1a","Hverdag, kveld 1600 - 2200",null,null,null,null,null,null,0]
[8,"2026-08-17","4a","Natt hverdag 2200 - 2400",null,null,null,null,null,null,0]
[8,"2026-08-18","4b","Natt hverdag 0000 - 0600",null,null,null,null,null,null,0]
[8,"2026-08-18","2a","Hverdag, morgen 0600 - 0800",null,null,null,null,null,null,0]
[8,"2026-08-18","1a","Hverdag, kveld 1600 - 2200",null,null,null,null,null,null,0]
[8,"2026-08-18","4a","Natt hverdag 2200 - 2400",null,null,null,null,null,null,0]
[8,"2026-08-19","4b","Natt hverdag 0000 - 0600",null,null,null,null,null,null,0]
[8,"2026-08-19","2a","Hverdag, morgen 0600 - 0800",null,null,null,null,null,null,0]
[8,"2026-08-19","1a","Hverdag, kveld 1600 - 2200",null,null,null,null,null,null,0]
[8,"2026-08-19","4a","Natt hverdag 2200 - 2400",null,null,null,null,null,null,0]
[8,"2026-08-20","4b","Natt hverdag 0000 - 0600",null,null,null,null,null,null,0]
[8,"2026-08-20","2a","Hverdag, morgen 0600 - 0800",null,null,null,null,null,null,0]
[8,"2026-08-20","1a","Hverdag, kveld 1600 - 2200",null,null,null,null,null,null,0]
[8,"2026-08-20","4a","Natt hverdag 2200 - 2400",null,null,null,null,null,null,0]
[8,"2026-08-21","4b","Natt hverdag 0000 - 0600",null,null,null,null,null,null,0]
[8,"2026-08-21","2a","Hverdag, morgen 0600 - 0800",null,null,null,null,null,null,0]
[8,"2026-08-21","1a","Hverdag, kveld 1600 - 2200",null,null,null,null,null,null,0]
[8,"2026-08-21","4a","Natt hverdag 2200 - 2400",null,null,null,null,null,null,0]
[8,"2026-08-22","4d","Natt lørdag, søndag 0000 - 0600",null,null,null,null,null,null,0]
[8,"2026-08-22","3a","Lørdag, søndag 0600 - 2200",null,null,null,null,null,null,0]
[8,"2026-08-22","4c","Natt lørdag, søndag 2200 - 2400",null,null,null,null,null,null,0]
[8,"2026-08-23","4d","Natt lørdag, søndag 0000 - 0600",null,null,null,null,null,null,0]
[8,"2026-08-23","3a","Lørdag, søndag 0600 - 2200",null,null,null,null,null,null,0]
[8,"2026-08-23","4c","Natt lørdag, søndag 2200 - 2400",null,null,null,null,null,null,0]
[8,"2026-08-24","4b","Natt hverdag 0000 - 0600",null,null,null,null,null,null,0]
[8,"2026-08-24","2a","Hverdag, morgen 0600 - 0800",null,null,null,null,null,null,0]
[8,"2026-08-24","1a","Hverdag, kveld 1600 - 2200",null,null,null,null,null,null,0]
[8,"2026-08-24","4a","Natt hverdag 2200 - 2400",null,null,null,null,null,null,0]
[8,"2026-08-25","4b","Natt hverdag 0000 - 0600",null,null,null,null,null,null,0]
[8,"2026-08-25","2a","Hverdag, morgen 0600 - 0800",null,null,null,null,null,null,0]
[8,"2026-08-25","1a","Hverdag, kveld 1600 - 2200",null,null,null,null,null,null,0]
[8,"2026-08-25","4a","Natt hverdag 2200 - 2400",null,null,null,null,null,null,0]
[8,"2026-08-26","4b","Natt hverdag 0000 - 0600",null,null,null,null,null,null,0]
[8,"2026-08-26","2a","Hverdag, morgen 0600 - 0800",null,null,null,null,null,null,0]
[8,"2026-08-26","1a","Hverdag, kveld 1600 - 2200",null,null,null,null,null,null,0]
[8,"2026-08-26","4a","Natt hverdag 2200 - 2400",null,null,null,null,null,null,0]
[8,"2026-08-27","4b","Natt hverdag 0000 - 0600",null,null,null,null,null,null,0]
[8,"2026-08-27","2a","Hverdag, morgen 0600 - 0800",null,null,null,null,null,null,0]
[8,"2026-08-27","1a","Hverdag, kveld 1600 - 2200",null,null,null,null,null,null,0]
[8,"2026-08-27","4a","Natt hverdag 2200 - 2400",null,null,null,null,null,null,0]
[8,"2026-08-28","4b","Natt hverdag 0000 - 0600",null,null,null,null,null,null,0]
[8,"2026-08-28","2a","Hverdag, morgen 0600 - 0800",null,null,null,null,null,null,0]
[8,"2026-08-28","1a","Hverdag, kveld 1600 - 2200",null,null,null,null,null,null,0]
[8,"2026-08-28","4a","Natt hverdag 2200 - 2400",null,null,null,null,null,null,0]
[8,"2026-08-29","4d","Natt lørdag, søndag 0000 - 0600",null,null,null,null,null,null,0]
[8,"2026-08-29","3a","Lørdag, søndag 0600 - 2200",null,null,null,null,null,null,0]
[8,"2026-08-29","4c","Natt lørdag, søndag 2200 - 2400",null,null,null,null,null,null,0]
[8,"2026-08-30","4d","Natt lørdag, søndag 0000 - 0600",null,null,null,null,null,null,0]
[8,"2026-08-30","3a","Lørdag, søndag 0600 - 2200",null,null,null,null,null,null,0]
[8,"2026-08-30","4c","Natt lørdag, søndag 2200 - 2400",null,null,null,null,null,null,0]
[8,"2026-08-31","4b",{"$f":"IF(C898=\"\",\"\",VLOOKUP(C898,Vaktperioder,2,0))","v":"Natt hverdag 0000 - 0600"},null,null,null,null,null,null,0]
[{"$f":"IF(B899=\"\",\"\",MONTH(B899))","v":8},"2026-08-31","2a","Hverdag, morgen 0600 - 0800",null,null,null,null,null,null,0]
[8,"2026-08-31","1a","Hverdag, kveld 1600 - 2200",null,null,null,null,null,null,0]
[{"$f":"IF(B901=\"\",\"\",MONTH(B901))","v":8},"2026-08-31","4a","Natt hverdag 2200 - 2400",null,null,null,null,null,null,0]
[9,"2026-09-01","4b","Natt hverdag 0000 - 0600",null,null,null,null,null,null,0]
[9,"2026-09-01","2a","Hverdag, morgen 0600 - 0800",null,null,null,null,null,null,{"$f":"IF(C902=\"3d\",IF(C903=\"4e\",0,1),0)","v":0}]
[9,"2026-09-01","1a","Hverdag, kveld 1600 - 2200",null,null,null,null,null,null,0]
[9,"2026-09-01","4a","Natt hverdag 2200 - 2400",null,null,null,null,null,null,0]
[9,"2026-09-02","4b","Natt hverdag 0000 - 0600",null,null,null,null,null,null,0]
[9,"2026-09-02","2a","Hverdag, morgen 0600 - 0800",null,null,null,null,null,null,0]
[9,"2026-09-02","1a","Hverdag, kveld 1600 - 2200",null,null,null,null,null,null,0]
[9,"2026-09-02","4a","Natt hverdag 2200 - 2400",null,null,null,null,null,null,0]
[9,"2026-09-03","4b","Natt hverdag 0000 - 0600",null,null,null,null,null,null,0]
[9,"2026-09-03","2a","Hverdag, morgen 0600 - 0800",null,null,null,null,null,null,0]
[9,"2026-09-03","1a","Hverdag, kveld 1600 - 2200",null,null,null,null,null,null,0]
[9,"2026-09-03","4a","Natt hverdag 2200 - 2400",null,null,null,null,null,null,0]
[9,"2026-09-04","4b","Natt hverdag 0000 - 0600",null,null,null,null,null,null,0]
[9,"2026-09-04","2a","Hverdag, morgen 0600 - 0800",null,null,null,null,null,null,0]
[9,"2026-09-04","1a","Hverdag, kveld 1600 - 2200",null,null,null,null,null,null,0]
[9,"2026-09-04","4a","Natt hverdag 2200 - 2400",null,null,null,null,null,null,0]
[9,"2026-09-05","4d","Natt lørdag, søndag 0000 - 0600",null,null,null,null,null,null,0]
[9,"2026-09-05","3a","Lørdag, søndag 0600 - 2200",null,null,null,null,null,null,0]
[9,"2026-09-05","4c","Natt lørdag, søndag 2200 - 2400",null,null,null,null,null,null,0]
[9,"2026-09-06","4d","Natt lørdag, søndag 0000 - 0600",null,null,null,null,null,null,0]
[9,"2026-09-06","3a","Lørdag, søndag 0600 - 2200",null,null,null,null,null,null,0]
[9,"2026-09-06","4c","Natt lørdag, søndag 2200 - 2400",null,null,null,null,null,null,0]
[9,"2026-09-07","4b","Natt hverdag 0000 - 0600",null,null,null,null,null,null,0]
[9,"2026-09-07","2a","Hverdag, morgen 0600 - 0800",null,null,null,null,null,null,0]
[9,"2026-09-07","1a","Hverdag, kveld 1600 - 2200",null,null,null,null,null,null,0]
[9,"2026-09-07","4a","Natt hverdag 2200 - 2400",null,null,null,null,null,null,0]
[9,"2026-09-08","4b","Natt hverdag 0000 - 0600",null,null,null,null,null,null,0]
[9,"2026-09-08","2a","Hverdag, morgen 0600 - 0800",null,null,null,null,null,null,0]
[9,"2026-09-08","1a","Hverdag, kveld 1600 - 2200",null,null,null,null,null,null,0]
[9,"2026-09-08","4a","Natt hverdag 2200 - 2400",null,null,null,null,null,null,0]
[9,"2026-09-09","4b","Natt hverdag 0000 - 0600",null,null,null,null,null,null,0]
[9,"2026-09-09","2a","Hverdag, morgen 0600 - 0800",null,null,null,null,null,null,0]
[9,"2026-09-09","1a","Hverdag, kveld 1600 - 2200",null,null,null,null,null,null,0]
[9,"2026-09-09","4a","Natt hverdag 2200 - 2400",null,null,null,null,null,null,0]
[9,"2026-09-10","4b","Natt hverdag 0000 - 0600",null,null,null,null,null,null,0]
[9,"2026-09-10","2a","Hverdag, morgen 0600 - 0800",null,null,null,null,null,null,0]
[9,"2026-09-10","1a","Hverdag, kveld 1600 - 2200",null,null,null,null,null,null,0]
[9,"2026-09-10","4a","Natt hverdag 2200 - 2400",null,null,null,null,null,null,0]
[9,"2026-09-11","4b","Natt hverdag 0000 - 0600",null,null,null,null,null,null,0]
[9,"2026-09-11","2a","Hverdag, morgen 0600 - 0800",null,null,null,null,null,null,0]
[9,"2026-09-11","1a","Hverdag, kveld 1600 - 2200",null,null,null,null,null,null,0]
[9,"2026-09-11","4a","Natt hverdag 2200 - 2400",null,null,null,null,null,null,0]
[9,"2026-09-12","4d","Natt lørdag, søndag 0000 - 0600",null,null,null,null,null,null,0]
[9,"2026-09-12","3a","Lørdag, søndag 0600 - 2200",null,null,null,null,null,null,0]
[9,"2026-09-12","4c","Natt lørdag, søndag 2200 - 2400",null,null,null,null,null,null,0]
[9,"2026-09-13","4d","Natt lørdag, søndag 0000 - 0600",null,null,null,null,null,null,0]
[9,"2026-09-13","3a","Lørdag, søndag 0600 - 2200",null,null,null,null,null,null,0]
[9,"2026-09-13","4c","Natt lørdag, søndag 2200 - 2400",null,null,null,null,null,null,0]
[9,"2026-09-14","4b","Natt hverdag 0000 - 0600",null,null,null,null,null,null,0]
[9,"2026-09-14","2a","Hverdag, morgen 0600 - 0800",null,null,null,null,null,null,0]
[9,"2026-09-14","1a","Hverdag, kveld 1600 - 2200",null,null,null,null,null,null,0]
[9,"2026-09-14","4a","Natt hverdag 2200 - 2400",null,null,null,null,null,null,0]
[9,"2026-09-15","4b","Natt hverdag 0000 - 0600",null,null,null,null,null,null,0]
[9,"2026-09-15","2a","Hverdag, morgen 0600 - 0800",null,null,null,null,null,null,0]
[9,"2026-09-15","1a","Hverdag, kveld 1600 - 2200",null,null,null,null,null,null,0]
[9,"2026-09-15","4a","Natt hverdag 2200 - 2400",null,null,null,null,null,null,0]
[9,"2026-09-16","4b","Natt hverdag 0000 - 0600",null,null,null,null,null,null,0]
[9,"2026-09-16","2a","Hverdag, morgen 0600 - 0800",null,null,null,null,null,null,0]
[9,"2026-09-16","1a","Hverdag, kveld 1600 - 2200",null,null,null,null,null,null,0]
[9,"2026-09-16","4a","Natt hverdag 2200 - 2400",null,null,null,null,null,null,0]
[9,"2026-09-17","4b",{"$f":"IF(C962=\"\",\"\",VLOOKUP(C962,Vaktperioder,2,0))","v":"Natt hverdag 0000 - 0600"},null,null,null,null,null,null,0]
[{"$f":"IF(B963=\"\",\"\",MONTH(B963))","v":9},"2026-09-17","2a","Hverdag, morgen 0600 - 0800",null,null,null,null,null,null,0]
[9,"2026-09-17","1a","Hverdag, kveld 1600 - 2200",null,null,null,null,null,null,0]
[9,"2026-09-17","4a","Natt hverdag 2200 - 2400",null,null,null,null,null,null,0]
[9,"2026-09-18","4b","Natt hverdag 0000 - 0600",null,null,null,null,null,null,0]
[9,"2026-09-18","2a","Hverdag, morgen 0600 - 0800",null,null,null,null,null,null,{"$f":"IF(C966=\"3d\",IF(C967=\"4e\",0,1),0)","v":0}]
[9,"2026-09-18","1a","Hverdag, kveld 1600 - 2200",null,null,null,null,null,null,0]
[9,"2026-09-18","4a","Natt hverdag 2200 - 2400",null,null,null,null,null,null,0]
[9,"2026-09-19","4d","Natt lørdag, søndag 0000 - 0600",null,null,null,null,null,null,0]
[9,"2026-09-19","3a","Lørdag, søndag 0600 - 2200",null,null,null,null,null,null,0]
[9,"2026-09-19","4c","Natt lørdag, søndag 2200 - 2400",null,null,null,null,null,null,0]
[9,"2026-09-20","4d","Natt lørdag, søndag 0000 - 0600",null,null,null,null,null,null,0]
[9,"2026-09-20","3a","Lørdag, søndag 0600 - 2200",null,null,null,null,null,null,0]
[9,"2026-09-20","4c","Natt lørdag, søndag 2200 - 2400",null,null,null,null,null,null,0]
[9,"2026-09-21","4b","Natt hverdag 0000 - 0600",null,null,null,null,null,null,0]
[9,"2026-09-21","2a","Hverdag, morgen 0600 - 0800",null,null,null,null,null,null,0]
[9,"2026-09-21","1a","Hverdag, kveld 1600 - 2200",null,null,null,null,null,null,0]
[9,"2026-09-21","4a","Natt hverdag 2200 - 2400",null,null,null,null,null,null,0]
[9,"2026-09-22","4b","Natt hverdag 0000 - 0600",null,null,null,null,null,null,0]
[{"$f":"IF(B981=\"\",\"\",MONTH(B981))","v":9},"2026-09-22","2a","Hverdag, morgen 0600 - 0800",null,null,null,null,null,null,0]
[9,"2026-09-22","1a","Hverdag, kveld 1600 - 2200",null,null,null,null,null,null,0]
[9,"2026-09-22","4a","Natt hverdag 2200 - 2400",null,null,null,null,null,null,0]
[9,"2026-09-23","4b","Natt hverdag 0000 - 0600",null,null,null,null,null,null,0]
[9,"2026-09-23","2a","Hverdag, morgen 0600 - 0800",null,null,null,null,null,null,0]
[9,"2026-09-23","1a","Hverdag, kveld 1600 - 2200",null,null,null,null,null,null,0]
[9,"2026-09-23","4a","Natt hverdag 2200 - 2400",null,null,null,null,null,null,0]
[9,"2026-09-24","4b","Natt hverdag 0000 - 0600",null,null,null,null,null,null,0]
[9,"2026-09-24","2a","Hverdag, morgen 0600 - 0800",null,null,null,null,null,null,0]
[9,"2026-09-24","1a","Hverdag, kveld 1600 - 2200",null,null,null,null,null,null,0]
[9,"2026-09-24","4a","Natt hverdag 2200 - 2400",null,null,null,null,null,null,0]
[9,"2026-09-25","4b","Natt hverdag 0000 - 0600",null,null,null,null,null,null,0]
[9,"2026-09-25","2a","Hverdag, morgen 0600 - 0800",null,null,null,null,null,null,0]
[9,"2026-09-25","1a","Hverdag, kveld 1600 - 2200",null,null,null,null,null,null,0]
[9,"2026-09-25","4a","Natt hverdag 2200 - 2400",null,null,null,null,null,null,0]
[9,"2026-09-26","4d","Natt lørdag, søndag 0000 - 0600",null,null,null,null,null,null,0]
[9,"2026-09-26","3a","Lørdag, søndag 0600 - 2200",null,null,null,null,null,null,0]
[9,"2026-09-26","4c","Natt lørdag, søndag 2200 - 2400",null,null,null,null,null,null,0]
[9,"2026-09-27","4d","Natt lørdag, søndag 0000 - 0600",null,null,null,null,null,null,0]
[9,"2026-09-27","3a","Lørdag, søndag 0600 - 2200",null,null,null,null,null,null,0]
[9,"2026-09-27","4c","Natt lørdag, søndag 2200 - 2400",null,null,null,null,null,null,0]
[9,"2026-09-28","4b","Natt hverdag 0000 - 0600",null,null,null,null,null,null,0]
[9,"2026-09-28","2a","Hverdag, morgen 0600 - 0800",null,null,null,null,null,null,0]
[9,"2026-09-28","1a","Hverdag, kveld 1600 - 2200",null,null,null,null,null,null,0]
[9,"2026-09-28","4a","Natt hverdag 2200 - 2400",null,null,null,null,null,null,0]
[9,"2026-09-29","4b","Natt hverdag 0000 - 0600",null,null,null,null,null,null,0]
[9,"2026-09-29","2a","Hverdag, morgen 0600 - 0800",null,null,null,null,null,null,0]
[9,"2026-09-29","1a","Hverdag, kveld 1600 - 2200",null,null,null,null,null,null,0]
[9,"2026-09-29","4a","Natt hverdag 2200 - 2400",null,null,null,null,null,null,0]
[9,"2026-09-30","4b","Natt hverdag 0000 - 0600",null,null,null,null,null,null,0]
[9,"2026-09-30","2a","Hverdag, morgen 0600 - 0800",null,null,null,null,null,null,0]
[9,"2026-09-30","1a","Hverdag, kveld 1600 - 2200",null,null,null,null,null,null,0]
[9,"2026-09-30","4a","Natt hverdag 2200 - 2400",null,null,null,null,null,null,0]
[10,"2026-10-01","4b","Natt hverdag 0000 - 0600",null,null,null,null,null,null,0]
[10,"2026-10-01","2a","Hverdag, morgen 0600 - 0800",null,null,null,null,null,null,0]
[10,"2026-10-01","1a","Hverdag, kveld 1600 - 2200",null,null,null,null,null,null,0]
[10,"2026-10-01","4a","Natt hverdag 2200 - 2400",null,null,null,null,null,null,0]
[10,"2026-10-02","4b","Natt hverdag 0000 - 0600",null,null,null,null,null,null,0]
[10,"2026-10-02","2a","Hverdag, morgen 0600 - 0800",null,null,null,null,null,null,0]
[10,"2026-10-02","1a","Hverdag, kveld 1600 - 2200",null,null,null,null,null,null,0]
[10,"2026-10-02","4a","Natt hverdag 2200 - 2400",null,null,null,null,null,null,0]
[10,"2026-10-03","4d","Natt lørdag, søndag 0000 - 0600",null,null,null,null,null,null,0]
[10,"2026-10-03","3a","Lørdag, søndag 0600 - 2200",null,null,null,null,null,null,0]
[10,"2026-10-03","4c","Natt lørdag, søndag 2200 - 2400",null,null,null,null,null,null,0]
[10,"2026-10-04","4d","Natt lørdag, søndag 0000 - 0600",null,null,null,null,null,null,0]
[10,"2026-10-04","3a",{"$f":"IF(C1026=\"\",\"\",VLOOKUP(C1026,Vaktperioder,2,0))","v":"Lørdag, søndag 0600 - 2200"},null,null,null,null,null,null,0]
[{"$f":"IF(B1027=\"\",\"\",MONTH(B1027))","v":10},"2026-10-04","4c","Natt lørdag, søndag 2200 - 2400",null,null,null,null,null,null,0]
[10,"2026-10-05","4b","Natt hverdag 0000 - 0600",null,null,null,null,null,null,0]
[10,"2026-10-05","2a","Hverdag, morgen 0600 - 0800",null,null,null,null,null,null,0]
[10,"2026-10-05","1a","Hverdag, kveld 1600 - 2200",null,null,null,null,null,null,0]
[10,"2026-10-05","4a","Natt hverdag 2200 - 2400",null,null,null,null,null,null,{"$f":"IF(C1030=\"3d\",IF(C1031=\"4e\",0,1),0)","v":0}]
[10,"2026-10-06","4b","Natt hverdag 0000 - 0600",null,null,null,null,null,null,0]
[10,"2026-10-06","2a","Hverdag, morgen 0600 - 0800",null,null,null,null,null,null,0]
[10,"2026-10-06","1a","Hverdag, kveld 1600 - 2200",null,null,null,null,null,null,0]
[10,"2026-10-06","4a","Natt hverdag 2200 - 2400",null,null,null,null,null,null,0]
[10,"2026-10-07","4b","Natt hverdag 0000 - 0600",null,null,null,null,null,null,0]
[10,"2026-10-07","2a","Hverdag, morgen 0600 - 0800",null,null,null,null,null,null,0]
[10,"2026-10-07","1a","Hverdag, kveld 1600 - 2200",null,null,null,null,null,null,0]
[10,"2026-10-07","4a","Natt hverdag 2200 - 2400",null,null,null,null,null,null,0]
[10,"2026-10-08","4b","Natt hverdag 0000 - 0600",null,null,null,null,null,null,0]
[10,"2026-10-08","2a","Hverdag, morgen 0600 - 0800",null,null,null,null,null,null,0]
[10,"2026-10-08","1a","Hverdag, kveld 1600 - 2200",null,null,null,null,null,null,0]
[10,"2026-10-08","4a","Natt hverdag 2200 - 2400",null,null,null,null,null,null,0]
[10,"2026-10-09","4b","Natt hverdag 0000 - 0600",null,null,null,null,null,null,0]
[10,"2026-10-09","2a","Hverdag, morgen 0600 - 0800",null,null,null,null,null,null,0]
[10,"2026-10-09","1a","Hverdag, kveld 1600 - 2200",null,null,null,null,null,null,0]
[10,"2026-10-09","4a","Natt hverdag 2200 - 2400",null,null,null,null,null,null,0]
[10,"2026-10-10","4d","Natt lørdag, søndag 0000 - 0600",null,null,null,null,null,null,0]
[10,"2026-10-10","3a","Lørdag, søndag 0600 - 2200",null,null,null,null,null,null,0]
[10,"2026-10-10","4c","Natt lørdag, søndag 2200 - 2400",null,null,null,null,null,null,0]
[10,"2026-10-11","4d","Natt lørdag, søndag 0000 - 0600",null,null,null,null,null,null,0]
[10,"2026-10-11","3a","Lørdag, søndag 0600 - 2200",null,null,null,null,null,null,0]
[10,"2026-10-11","4c","Natt lørdag, søndag 2200 - 2400",null,null,null,null,null,null,0]
[10,"2026-10-12","4b","Natt hverdag 0000 - 0600",null,null,null,null,null,null,0]
[10,"2026-10-12","2a","Hverdag, morgen 0600 - 0800",null,null,null,null,null,null,0]
[10,"2026-10-12","1a","Hverdag, kveld 1600 - 2200",null,null,null,null,null,null,0]
[10,"2026-10-12","4a","Natt hverdag 2200 - 2400",null,null,null,null,null,null,0]
[10,"2026-10-13","4b","Natt hverdag 0000 - 0600",null,null,null,null,null,null,0]
[10,"2026-10-13","2a","Hverdag, morgen 0600 - 0800",null,null,null,null,null,null,0]
[10,"2026-10-13","1a","Hverdag, kveld 1600 - 2200",null,null,null,null,null,null,0]
[10,"2026-10-13","4a","Natt hverdag 2200 - 2400",null,null,null,null,null,null,0]
[10,"2026-10-14","4b","Natt hverdag 0000 - 0600",null,null,null,null,null,null,0]
[10,"2026-10-14","2a","Hverdag, morgen 0600 - 0800",null,null,null,null,null,null,0]
[10,"2026-10-14","1a","Hverdag, kveld 1600 - 2200",null,null,null,null,null,null,0]
[10,"2026-10-14","4a","Natt hverdag 2200 - 2400",null,null,null,null,null,null,0]
[10,"2026-10-15","4b","Natt hverdag 0000 - 0600",null,null,null,null,null,null,0]
[10,"2026-10-15","2a","Hverdag, morgen 0600 - 0800",null,null,null,null,null,null,0]
[10,"2026-10-15","1a","Hverdag, kveld 1600 - 2200",null,null,null,null,null,null,0]
[10,"2026-10-15","4a","Natt hverdag 2200 - 2400",null,null,null,null,null,null,0]
[10,"2026-10-16","4b","Natt hverdag 0000 - 0600",null,null,null,null,null,null,0]
[10,"2026-10-16","2a","Hverdag, morgen 0600 - 0800",null,null,null,null,null,null,0]
[10,"2026-10-16","1a","Hverdag, kveld 1600 - 2200",null,null,null,null,null,null,0]
[10,"2026-10-16","4a","Natt hverdag 2200 - 2400",null,null,null,null,null,null,0]
[10,"2026-10-17","4d","Natt lørdag, søndag 0000 - 0600",null,null,null,null,null,null,0]
[10,"2026-10-17","3a","Lørdag, søndag 0600 - 2200",null,null,null,null,null,null,0]
[10,"2026-10-17","4c","Natt lørdag, søndag 2200 - 2400",null,null,null,null,null,null,0]
[10,"2026-10-18","4d","Natt lørdag, søndag 0000 - 0600",null,null,null,null,null,null,0]
[10,"2026-10-18","3a","Lørdag, søndag 0600 - 2200",null,null,null,null,null,null,0]
[10,"2026-10-18","4c","Natt lørdag, søndag 2200 - 2400",null,null,null,null,null,null,0]
[10,"2026-10-19","4b","Natt hverdag 0000 - 0600",null,null,null,null,null,null,0]
[10,"2026-10-19","2a","Hverdag, morgen 0600 - 0800",null,null,null,null,null,null,0]
[10,"2026-10-19","1a","Hverdag, kveld 1600 - 2200",null,null,null,null,null,null,0]
[10,"2026-10-19","4a","Natt hverdag 2200 - 2400",null,null,null,null,null,null,0]
[10,"2026-10-20","4b","Natt hverdag 0000 - 0600",null,null,null,null,null,null,0]
[10,"2026-10-20","2a","Hverdag, morgen 0600 - 0800",null,null,null,null,null,null,0]
[10,"2026-10-20","1a","Hverdag, kveld 1600 - 2200",null,null,null,null,null,null,0]
[10,"2026-10-20","4a","Natt hverdag 2200 - 2400",null,null,null,null,null,null,0]
[10,"2026-10-21","4b","Natt hverdag 0000 - 0600",null,null,null,null,null,null,0]
[10,"2026-10-21","2a","Hverdag, morgen 0600 - 0800",null,null,null,null,null,null,0]
[10,"2026-10-21","1a",{"$f":"IF(C1090=\"\",\"\",VLOOKUP(C1090,Vaktperioder,2,0))","v":"Hverdag, kveld 1600 - 2200"},null,null,null,null,null,null,0]
[{"$f":"IF(B1091=\"\",\"\",MONTH(B1091))","v":10},"2026-10-21","4a","Natt hverdag 2200 - 2400",null,null,null,null,null,null,0]
[10,"2026-10-22","4b","Natt hverdag 0000 - 0600",null,null,null,null,null,null,0]
[10,"2026-10-22","2a","Hverdag, morgen 0600 - 0800",null,null,null,null,null,null,0]
[10,"2026-10-22","1a","Hverdag, kveld 1600 - 2200",null,null,null,null,null,null,0]
[10,"2026-10-22","4a","Natt hverdag 2200 - 2400",null,null,null,null,null,null,{"$f":"IF(C1094=\"3d\",IF(C1095=\"4e\",0,1),0)","v":0}]
[10,"2026-10-23","4b","Natt hverdag 0000 - 0600",null,null,null,null,null,null,0]
[10,"2026-10-23","2a","Hverdag, morgen 0600 - 0800",null,null,null,null,null,null,0]
[10,"2026-10-23","1a","Hverdag, kveld 1600 - 2200",null,null,null,null,null,null,0]
[10,"2026-10-23","4a","Natt hverdag 2200 - 2400",null,null,null,null,null,null,0]
[10,"2026-10-24","4d","Natt lørdag, søndag 0000 - 0600",null,null,null,null,null,null,0]
[10,"2026-10-24","3a","Lørdag, søndag 0600 - 2200",null,null,null,null,null,null,0]
[10,"2026-10-24","4c","Natt lørdag, søndag 2200 - 2400",null,null,null,null,null,null,0]
[10,"2026-10-25","4d","Natt lørdag, søndag 0000 - 0600",null,null,null,null,null,null,0]
[10,"2026-10-25","3a","Lørdag, søndag 0600 - 2200",null,null,null,null,null,null,0]
[10,"2026-10-25","4c","Natt lørdag, søndag 2200 - 2400",null,null,null,null,null,null,0]
[10,"2026-10-26","4b","Natt hverdag 0000 - 0600",null,null,null,null,null,null,0]
[10,"2026-10-26","2a","Hverdag, morgen 0600 - 0800",null,null,null,null,null,null,0]
[10,"2026-10-26","1a","Hverdag, kveld 1600 - 2200",null,null,null,null,null,null,0]
[10,"2026-10-26","4a","Natt hverdag 2200 - 2400",null,null,null,null,null,null,0]
[10,"2026-10-27","4b","Natt hverdag 0000 - 0600",null,null,null,null,null,null,0]
[10,"2026-10-27","2a","Hverdag, morgen 0600 - 0800",null,null,null,null,null,null,0]
[10,"2026-10-27","1a","Hverdag, kveld 1600 - 2200",null,null,null,null,null,null,0]
[10,"2026-10-27","4a","Natt hverdag 2200 - 2400",null,null,null,null,null,null,0]
[10,"2026-10-28","4b","Natt hverdag 0000 - 0600",null,null,null,null,null,null,0]
[10,"2026-10-28","2a","Hverdag, morgen 0600 - 0800",null,null,null,null,null,null,0]
[10,"2026-10-28","1a","Hverdag, kveld 1600 - 2200",null,null,null,null,null,null,0]
[10,"2026-10-28","4a","Natt hverdag 2200 - 2400",null,null,null,null,null,null,0]
[10,"2026-10-29","4b","Natt hverdag 0000 - 0600",null,null,null,null,null,null,0]
[10,"2026-10-29","2a","Hverdag, morgen 0600 - 0800",null,null,null,null,null,null,0]
[10,"2026-10-29","1a","Hverdag, kveld 1600 - 2200",null,null,null,null,null,null,0]
[10,"2026-10-29","4a","Natt hverdag 2200 - 2400",null,null,null,null,null,null,0]
[10,"2026-10-30","4b","Natt hverdag 0000 - 0600",null,null,null,null,null,null,0]
[10,"2026-10-30","2a","Hverdag, morgen 0600 - 0800",null,null,null,null,null,null,0]
[10,"2026-10-30","1a","Hverdag, kveld 1600 - 2200",null,null,null,null,null,null,0]
[10,"2026-10-30","4a","Natt hverdag 2200 - 2400",null,null,null,null,null,null,0]
[10,"2026-10-31","4d","Natt lørdag, søndag 0000 - 0600",null,null,null,null,null,null,0]
[10,"2026-10-31","3a","Lørdag, søndag 0600 - 2200",null,null,null,null,null,null,0]
[10,"2026-10-31","4c","Natt lørdag, søndag 2200 - 2400",null,null,null,null,null,null,0]
[11,"2026-11-01","4d","Natt lørdag, søndag 0000 - 0600",null,null,null,null,null,null,0]
[11,"2026-11-01","3a","Lørdag, søndag 0600 - 2200",null,null,null,null,null,null,0]
[11,"2026-11-01","4c","Natt lørdag, søndag 2200 - 2400",null,null,null,null,null,null,0]
[11,"2026-11-02","4b","Natt hverdag 0000 - 0600",null,null,null,null,null,null,0]
[11,"2026-11-02","2a","Hverdag, morgen 0600 - 0800",null,null,null,null,null,null,0]
[11,"2026-11-02","1a","Hverdag, kveld 1600 - 2200",null,null,null,null,null,null,0]
[11,"2026-11-02","4a","Natt hverdag 2200 - 2400",null,null,null,null,null,null,0]
[11,"2026-11-03","4b","Natt hverdag 0000 - 0600",null,null,null,null,null,null,0]
[11,"2026-11-03","2a","Hverdag, morgen 0600 - 0800",null,null,null,null,null,null,0]
[11,"2026-11-03","1a","Hverdag, kveld 1600 - 2200",null,null,null,null,null,null,0]
[11,"2026-11-03","4a","Natt hverdag 2200 - 2400",null,null,null,null,null,null,0]
[11,"2026-11-04","4b","Natt hverdag 0000 - 0600",null,null,null,null,null,null,0]
[11,"2026-11-04","2a","Hverdag, morgen 0600 - 0800",null,null,null,null,null,null,0]
[11,"2026-11-04","1a","Hverdag, kveld 1600 - 2200",null,null,null,null,null,null,0]
[11,"2026-11-04","4a","Natt hverdag 2200 - 2400",null,null,null,null,null,null,0]
[11,"2026-11-05","4b","Natt hverdag 0000 - 0600",null,null,null,null,null,null,0]
[11,"2026-11-05","2a","Hverdag, morgen 0600 - 0800",null,null,null,null,null,null,0]
[11,"2026-11-05","1a","Hverdag, kveld 1600 - 2200",null,null,null,null,null,null,0]
[11,"2026-11-05","4a","Natt hverdag 2200 - 2400",null,null,null,null,null,null,0]
[11,"2026-11-06","4b","Natt hverdag 0000 - 0600",null,null,null,null,null,null,0]
[11,"2026-11-06","2a","Hverdag, morgen 0600 - 0800",null,null,null,null,null,null,0]
[11,"2026-11-06","1a","Hverdag, kveld 1600 - 2200",null,null,null,null,null,null,0]
[11,"2026-11-06","4a","Natt hverdag 2200 - 2400",null,null,null,null,null,null,0]
[11,"2026-11-07","4d","Natt lørdag, søndag 0000 - 0600",null,null,null,null,null,null,0]
[11,"2026-11-07","3a","Lørdag, søndag 0600 - 2200",null,null,null,null,null,null,0]
[11,"2026-11-07","4c",{"$f":"IF(C1154=\"\",\"\",VLOOKUP(C1154,Vaktperioder,2,0))","v":"Natt lørdag, søndag 2200 - 2400"},null,null,null,null,null,null,0]
[{"$f":"IF(B1155=\"\",\"\",MONTH(B1155))","v":11},"2026-11-08","4d","Natt lørdag, søndag 0000 - 0600",null,null,null,null,null,null,0]
[11,"2026-11-08","3a","Lørdag, søndag 0600 - 2200",null,null,null,null,null,null,0]
[11,"2026-11-08","4c","Natt lørdag, søndag 2200 - 2400",null,null,null,null,null,null,0]
[11,"2026-11-09","4b","Natt hverdag 0000 - 0600",null,null,null,null,null,null,0]
[11,"2026-11-09","2a","Hverdag, morgen 0600 - 0800",null,null,null,null,null,null,{"$f":"IF(C1158=\"3d\",IF(C1159=\"4e\",0,1),0)","v":0}]
[11,"2026-11-09","1a","Hverdag, kveld 1600 - 2200",null,null,null,null,null,null,0]
[11,"2026-11-09","4a","Natt hverdag 2200 - 2400",null,null,null,null,null,null,0]
[11,"2026-11-10","4b","Natt hverdag 0000 - 0600",null,null,null,null,null,null,0]
[11,"2026-11-10","2a","Hverdag, morgen 0600 - 0800",null,null,null,null,null,null,0]
[11,"2026-11-10","1a","Hverdag, kveld 1600 - 2200",null,null,null,null,null,null,0]
[11,"2026-11-10","4a","Natt hverdag 2200 - 2400",null,null,null,null,null,null,0]
[11,"2026-11-11","4b","Natt hverdag 0000 - 0600",null,null,null,null,null,null,0]
[11,"2026-11-11","2a","Hverdag, morgen 0600 - 0800",null,null,null,null,null,null,0]
[11,"2026-11-11","1a","Hverdag, kveld 1600 - 2200",null,null,null,null,null,null,0]
[11,"2026-11-11","4a","Natt hverdag 2200 - 2400",null,null,null,null,null,null,0]
[11,"2026-11-12","4b","Natt hverdag 0000 - 0600",null,null,null,null,null,null,0]
[11,"2026-11-12","2a","Hverdag, morgen 0600 - 0800",null,null,null,null,null,null,0]
[11,"2026-11-12","1a","Hverdag, kveld 1600 - 2200",null,null,null,null,null,null,0]
[11,"2026-11-12","4a","Natt hverdag 2200 - 2400",null,null,null,null,null,null,0]
[11,"2026-11-13","4b","Natt hverdag 0000 - 0600",null,null,null,null,null,null,0]
[11,"2026-11-13","2a","Hverdag, morgen 0600 - 0800",null,null,null,null,null,null,0]
[11,"2026-11-13","1a","Hverdag, kveld 1600 - 2200",null,null,null,null,null,null,0]
[11,"2026-11-13","4a","Natt hverdag 2200 - 2400",null,null,null,null,null,null,0]
[11,"2026-11-14","4d","Natt lørdag, søndag 0000 - 0600",null,null,null,null,null,null,0]
[11,"2026-11-14","3a","Lørdag, søndag 0600 - 2200",null,null,null,null,null,null,0]
[11,"2026-11-14","4c","Natt lørdag, søndag 2200 - 2400",null,null,null,null,null,null,0]
[11,"2026-11-15","4d","Natt lørdag, søndag 0000 - 0600",null,null,null,null,null,null,0]
[11,"2026-11-15","3a","Lørdag, søndag 0600 - 2200",null,null,null,null,null,null,0]
[11,"2026-11-15","4c","Natt lørdag, søndag 2200 - 2400",null,null,null,null,null,null,0]
[11,"2026-11-16","4b","Natt hverdag 0000 - 0600",null,null,null,null,null,null,0]
[11,"2026-11-16","2a","Hverdag, morgen 0600 - 0800",null,null,null,null,null,null,0]
[11,"2026-11-16","1a","Hverdag, kveld 1600 - 2200",null,null,null,null,null,null,0]
[11,"2026-11-16","4a","Natt hverdag 2200 - 2400",null,null,null,null,null,null,0]
[11,"2026-11-17","4b","Natt hverdag 0000 - 0600",null,null,null,null,null,null,0]
[11,"2026-11-17","2a","Hverdag, morgen 0600 - 0800",null,null,null,null,null,null,0]
[11,"2026-11-17","1a","Hverdag, kveld 1600 - 2200",null,null,null,null,null,null,0]
[11,"2026-11-17","4a","Natt hverdag 2200 - 2400",null,null,null,null,null,null,0]
[11,"2026-11-18","4b","Natt hverdag 0000 - 0600",null,null,null,null,null,null,0]
[11,"2026-11-18","2a","Hverdag, morgen 0600 - 0800",null,null,null,null,null,null,0]
[11,"2026-11-18","1a","Hverdag, kveld 1600 - 2200",null,null,null,null,null,null,0]
[11,"2026-11-18","4a","Natt hverdag 2200 - 2400",null,null,null,null,null,null,0]
[11,"2026-11-19","4b","Natt hverdag 0000 - 0600",null,null,null,null,null,null,0]
[11,"2026-11-19","2a","Hverdag, morgen 0600 - 0800",null,null,null,null,null,null,0]
[11,"2026-11-19","1a","Hverdag, kveld 1600 - 2200",null,null,null,null,null,null,0]
[11,"2026-11-19","4a","Natt hverdag 2200 - 2400",null,null,null,null,null,null,0]
[11,"2026-11-20","4b","Natt hverdag 0000 - 0600",null,null,null,null,null,null,0]
[11,"2026-11-20","2a","Hverdag, morgen 0600 - 0800",null,null,null,null,null,null,0]
[11,"2026-11-20","1a","Hverdag, kveld 1600 - 2200",null,null,null,null,null,null,0]
[11,"2026-11-20","4a","Natt hverdag 2200 - 2400",null,null,null,null,null,null,0]
[11,"2026-11-21","4d","Natt lørdag, søndag 0000 - 0600",null,null,null,null,null,null,0]
[11,"2026-11-21","3a","Lørdag, søndag 0600 - 2200",null,null,null,null,null,null,0]
[11,"2026-11-21","4c","Natt lørdag, søndag 2200 - 2400",null,null,null,null,null,null,0]
[11,"2026-11-22","4d","Natt lørdag, søndag 0000 - 0600",null,null,null,null,null,null,0]
[11,"2026-11-22","3a","Lørdag, søndag 0600 - 2200",null,null,null,null,null,null,0]
[11,"2026-11-22","4c","Natt lørdag, søndag 2200 - 2400",null,null,null,null,null,null,0]
[11,"2026-11-23","4b","Natt hverdag 0000 - 0600",null,null,null,null,null,null,0]
[11,"2026-11-23","2a","Hverdag, morgen 0600 - 0800",null,null,null,null,null,null,0]
[11,"2026-11-23","1a","Hverdag, kveld 1600 - 2200",null,null,null,null,null,null,0]
[11,"2026-11-23","4a","Natt hverdag 2200 - 2400",null,null,null,null,null,null,0]
[11,"2026-11-24","4b","Natt hverdag 0000 - 0600",null,null,null,null,null,null,0]
[11,"2026-11-24","2a","Hverdag, morgen 0600 - 0800",null,null,null,null,null,null,0]
[11,"2026-11-24","1a","Hverdag, kveld 1600 - 2200",null,null,null,null,null,null,0]
[11,"2026-11-24","4a","Natt hverdag 2200 - 2400",null,null,null,null,null,null,0]
[11,"2026-11-25","4b",{"$f":"IF(C1218=\"\",\"\",VLOOKUP(C1218,Vaktperioder,2,0))","v":"Natt hverdag 0000 - 0600"},null,null,null,null,null,null,0]
[{"$f":"IF(B1219=\"\",\"\",MONTH(B1219))","v":11},"2026-11-25","2a","Hverdag, morgen 0600 - 0800",null,null,null,null,null,null,0]
[11,"2026-11-25","1a","Hverdag, kveld 1600 - 2200",null,null,null,null,null,null,0]
[11,"2026-11-25","4a","Natt hverdag 2200 - 2400",null,null,null,null,null,null,0]
[11,"2026-11-26","4b","Natt hverdag 0000 - 0600",null,null,null,null,null,null,0]
[11,"2026-11-26","2a","Hverdag, morgen 0600 - 0800",null,null,null,null,null,null,{"$f":"IF(C1222=\"3d\",IF(C1223=\"4e\",0,1),0)","v":0}]
[11,"2026-11-26","1a","Hverdag, kveld 1600 - 2200",null,null,null,null,null,null,0]
[11,"2026-11-26","4a","Natt hverdag 2200 - 2400",null,null,null,null,null,null,0]
[11,"2026-11-27","4b","Natt hverdag 0000 - 0600",null,null,null,null,null,null,0]
[11,"2026-11-27","2a","Hverdag, morgen 0600 - 0800",null,null,null,null,null,null,0]
[11,"2026-11-27","1a","Hverdag, kveld 1600 - 2200",null,null,null,null,null,null,0]
[11,"2026-11-27","4a","Natt hverdag 2200 - 2400",null,null,null,null,null,null,0]
[11,"2026-11-28","4d","Natt lørdag, søndag 0000 - 0600",null,null,null,null,null,null,0]
[11,"2026-11-28","3a","Lørdag, søndag 0600 - 2200",null,null,null,null,null,null,0]
[11,"2026-11-28","4c","Natt lørdag, søndag 2200 - 2400",null,null,null,null,null,null,0]
[11,"2026-11-29","4d","Natt lørdag, søndag 0000 - 0600",null,null,null,null,null,null,0]
[11,"2026-11-29","3a","Lørdag, søndag 0600 - 2200",null,null,null,null,null,null,0]
[11,"2026-11-29","4c","Natt lørdag, søndag 2200 - 2400",null,null,null,null,null,null,0]
[11,"2026-11-30","4b","Natt hverdag 0000 - 0600",null,null,null,null,null,null,0]
[11,"2026-11-30","2a","Hverdag, morgen 0600 - 0800",null,null,null,null,null,null,0]
[11,"2026-11-30","1a","Hverdag, kveld 1600 - 2200",null,null,null,null,null,null,0]
[11,"2026-11-30","4a","Natt hverdag 2200 - 2400",null,null,null,null,null,null,0]
[12,"2026-12-01","4b","Natt hverdag 0000 - 0600",null,null,null,null,null,null,0]
[12,"2026-12-01","2a","Hverdag, morgen 0600 - 0800",null,null,null,null,null,null,0]
[12,"2026-12-01","1a","Hverdag, kveld 1600 - 2200",null,null,null,null,null,null,0]
[12,"2026-12-01","4a","Natt hverdag 2200 - 2400",null,null,null,null,null,null,0]
[12,"2026-12-02","4b","Natt hverdag 0000 - 0600",null,null,null,null,null,null,0]
[12,"2026-12-02","2a","Hverdag, morgen 0600 - 0800",null,null,null,null,null,null,0]
[12,"2026-12-02","1a","Hverdag, kveld 1600 - 2200",null,null,null,null,null,null,0]
[12,"2026-12-02","4a","Natt hverdag 2200 - 2400",null,null,null,null,null,null,0]
[12,"2026-12-03","4b","Natt hverdag 0000 - 0600",null,null,null,null,null,null,0]
[12,"2026-12-03","2a","Hverdag, morgen 0600 - 0800",null,null,null,null,null,null,0]
[12,"2026-12-03","1a","Hverdag, kveld 1600 - 2200",null,null,null,null,null,null,0]
[12,"2026-12-03","4a","Natt hverdag 2200 - 2400",null,null,null,null,null,null,0]
[12,"2026-12-04","4b","Natt hverdag 0000 - 0600",null,null,null,null,null,null,0]
[12,"2026-12-04","2a","Hverdag, morgen 0600 - 0800",null,null,null,null,null,null,0]
[12,"2026-12-04","1a","Hverdag, kveld 1600 - 2200",null,null,null,null,null,null,0]
[12,"2026-12-04","4a","Natt hverdag 2200 - 2400",null,null,null,null,null,null,0]
[12,"2026-12-05","4d","Natt lørdag, søndag 0000 - 0600",null,null,null,null,null,null,0]
[12,"2026-12-05","3a","Lørdag, søndag 0600 - 2200",null,null,null,null,null,null,0]
[12,"2026-12-05","4c","Natt lørdag, søndag 2200 - 2400",null,null,null,null,null,null,0]
[12,"2026-12-06","4d","Natt lørdag, søndag 0000 - 0600",null,null,null,null,null,null,0]
[12,"2026-12-06","3a","Lørdag, søndag 0600 - 2200",null,null,null,null,null,null,0]
[12,"2026-12-06","4c","Natt lørdag, søndag 2200 - 2400",null,null,null,null,null,null,0]
[12,"2026-12-07","4b","Natt hverdag 0000 - 0600",null,null,null,null,null,null,0]
[12,"2026-12-07","2a","Hverdag, morgen 0600 - 0800",null,null,null,null,null,null,0]
[12,"2026-12-07","1a","Hverdag, kveld 1600 - 2200",null,null,null,null,null,null,0]
[12,"2026-12-07","4a","Natt hverdag 2200 - 2400",null,null,null,null,null,null,0]
[12,"2026-12-08","4b","Natt hverdag 0000 - 0600",null,null,null,null,null,null,0]
[12,"2026-12-08","2a","Hverdag, morgen 0600 - 0800",null,null,null,null,null,null,0]
[12,"2026-12-08","1a","Hverdag, kveld 1600 - 2200",null,null,null,null,null,null,0]
[12,"2026-12-08","4a","Natt hverdag 2200 - 2400",null,null,null,null,null,null,0]
[12,"2026-12-09","4b","Natt hverdag 0000 - 0600",null,null,null,null,null,null,0]
[12,"2026-12-09","2a","Hverdag, morgen 0600 - 0800",null,null,null,null,null,null,0]
[12,"2026-12-09","1a","Hverdag, kveld 1600 - 2200",null,null,null,null,null,null,0]
[12,"2026-12-09","4a","Natt hverdag 2200 - 2400",null,null,null,null,null,null,0]
[12,"2026-12-10","4b","Natt hverdag 0000 - 0600",null,null,null,null,null,null,0]
[12,"2026-12-10","2a","Hverdag, morgen 0600 - 0800",null,null,null,null,null,null,0]
[12,"2026-12-10","1a","Hverdag, kveld 1600 - 2200",null,null,null,null,null,null,0]
[12,"2026-12-10","4a","Natt hverdag 2200 - 2400",null,null,null,null,null,null,0]
[12,"2026-12-11","4b","Natt hverdag 0000 - 0600",null,null,null,null,null,null,0]
[12,"2026-12-11","2a","Hverdag, morgen 0600 - 0800",null,null,null,null,null,null,0]
[12,"2026-12-11","1a","Hverdag, kveld 1600 - 2200",null,null,null,null,null,null,0]
[12,"2026-12-11","4a","Natt hverdag 2200 - 2400",null,null,null,null,null,null,0]
[12,"2026-12-12","4d",{"$f":"IF(C1282=\"\",\"\",VLOOKUP(C1282,Vaktperioder,2,0))","v":"Natt lørdag, søndag 0000 - 0600"},null,null,null,null,null,null,0]
[{"$f":"IF(B1283=\"\",\"\",MONTH(B1283))","v":12},"2026-12-12","3a","Lørdag, søndag 0600 - 2200",null,null,null,null,null,null,0]
[12,"2026-12-12","4c","Natt lørdag, søndag 2200 - 2400",null,null,null,null,null,null,0]
[12,"2026-12-13","4d","Natt lørdag, søndag 0000 - 0600",null,null,null,null,null,null,0]
[12,"2026-12-13","3a","Lørdag, søndag 0600 - 2200",null,null,null,null,null,null,0]
[12,"2026-12-13","4c","Natt lørdag, søndag 2200 - 2400",null,null,null,null,null,null,{"$f":"IF(C1286=\"3d\",IF(C1287=\"4e\",0,1),0)","v":0}]
[12,"2026-12-14","4b","Natt hverdag 0000 - 0600",null,null,null,null,null,null,0]
[12,"2026-12-14","2a","Hverdag, morgen 0600 - 0800",null,null,null,null,null,null,0]
[12,"2026-12-14","1a","Hverdag, kveld 1600 - 2200",null,null,null,null,null,null,0]
[12,"2026-12-14","4a","Natt hverdag 2200 - 2400",null,null,null,null,null,null,0]
[12,"2026-12-15","4b","Natt hverdag 0000 - 0600",null,null,null,null,null,null,0]
[12,"2026-12-15","2a","Hverdag, morgen 0600 - 0800",null,null,null,null,null,null,0]
[12,"2026-12-15","1a","Hverdag, kveld 1600 - 2200",null,null,null,null,null,null,0]
[12,"2026-12-15","4a","Natt hverdag 2200 - 2400",null,null,null,null,null,null,0]
[12,"2026-12-16","4b","Natt hverdag 0000 - 0600",null,null,null,null,null,null,0]
[12,"2026-12-16","2a","Hverdag, morgen 0600 - 0800",null,null,null,null,null,null,0]
[12,"2026-12-16","1a","Hverdag, kveld 1600 - 2200",null,null,null,null,null,null,0]
[12,"2026-12-16","4a","Natt hverdag 2200 - 2400",null,null,null,null,null,null,0]
[12,"2026-12-17","4b","Natt hverdag 0000 - 0600",null,null,null,null,null,null,0]
[12,"2026-12-17","2a","Hverdag, morgen 0600 - 0800",null,null,null,null,null,null,0]
[12,"2026-12-17","1a","Hverdag, kveld 1600 - 2200",null,null,null,null,null,null,0]
[12,"2026-12-17","4a","Natt hverdag 2200 - 2400",null,null,null,null,null,null,0]
[12,"2026-12-18","4b","Natt hverdag 0000 - 0600",null,null,null,null,null,null,0]
[12,"2026-12-18","2a","Hverdag, morgen 0600 - 0800",null,null,null,null,null,null,0]
[12,"2026-12-18","1a","Hverdag, kveld 1600 - 2200",null,null,null,null,null,null,0]
[12,"2026-12-18","4a","Natt hverdag 2200 - 2400",null,null,null,null,null,null,0]
[12,"2026-12-19","4d","Natt lørdag, søndag 0000 - 0600",null,null,null,null,null,null,0]
[12,"2026-12-19","3a","Lørdag, søndag 0600 - 2200",null,null,null,null,null,null,0]
[12,"2026-12-19","4c","Natt lørdag, søndag 2200 - 2400",null,null,null,null,null,null,0]
[12,"2026-12-20","4d","Natt lørdag, søndag 0000 - 0600",null,null,null,null,null,null,0]
[12,"2026-12-20","3a","Lørdag, søndag 0600 - 2200",null,null,null,null,null,null,0]
[12,"2026-12-20","4c","Natt lørdag, søndag 2200 - 2400",null,null,null,null,null,null,0]
[12,"2026-12-21","4b","Natt hverdag 0000 - 0600",null,null,null,null,null,null,0]
[12,"2026-12-21","2a","Hverdag, morgen 0600 - 0800",null,null,null,null,null,null,0]
[12,"2026-12-21","1a","Hverdag, kveld 1600 - 2200",null,null,null,null,null,null,0]
[12,"2026-12-21","4a","Natt hverdag 2200 - 2400",null,null,null,null,null,null,0]
[12,"2026-12-22","4b","Natt hverdag 0000 - 0600",null,null,null,null,null,null,0]
[12,"2026-12-22","2a","Hverdag, morgen 0600 - 0800",null,null,null,null,null,null,0]
[12,"2026-12-22","1a","Hverdag, kveld 1600 - 2200",null,null,null,null,null,null,0]
[12,"2026-12-22","4a","Natt hverdag 2200 - 2400",null,null,null,null,null,null,0]
[12,"2026-12-23","4b","Natt hverdag 0000 - 0600",null,null,null,null,null,null,0]
[12,"2026-12-23","2a","Hverdag, morgen 0600 - 0800",null,null,null,null,null,null,0]
[12,"2026-12-23","1a","Hverdag, kveld 1600 - 2200",null,null,null,null,null,null,0]
[12,"2026-12-23","4a","Natt hverdag 2200 - 2400",null,null,null,null,null,null,0]
[12,"2026-12-24","4b","Natt hverdag 0000 - 0600",null,null,null,null,null,null,0]
[12,"2026-12-24","3c","Jul- og nyttårsaften 0600 - 1200",null,null,null,null,null,null,0]
[12,"2026-12-24","3d","Påske-, jul- og nyttårsaften 1200 - 2200",null,null,null,null,null,null,0]
[12,"2026-12-24","4e","Natt hellig- og høytidsdag 2200 - 2400",null,null,null,null,null,null,0]
[12,"2026-12-25","4f","Natt hellig- og høytidsdag 0000 - 0600",null,null,null,null,null,null,0]
[12,"2026-12-25","3b","Hellig- og høytidsdag 0600 - 2200",null,null,null,null,null,null,0]
[12,"2026-12-25","4e","Natt hellig- og høytidsdag 2200 - 2400",null,null,null,null,null,null,0]
[12,"2026-12-26","4f","Natt hellig- og høytidsdag 0000 - 0600",null,null,null,null,null,null,0]
[12,"2026-12-26","3b","Hellig- og høytidsdag 0600 - 2200",null,null,null,null,null,null,0]
[12,"2026-12-26","4e","Natt hellig- og høytidsdag 2200 - 2400",null,null,null,null,null,null,0]
[12,"2026-12-27","4d","Natt lørdag, søndag 0000 - 0600",null,null,null,null,null,null,0]
[12,"2026-12-27","3a","Lørdag, søndag 0600 - 2200",null,null,null,null,null,null,0]
[12,"2026-12-27","4c","Natt lørdag, søndag 2200 - 2400",null,null,null,null,null,null,0]
[12,"2026-12-28","4b","Natt hverdag 0000 - 0600",null,null,null,null,null,null,0]
[12,"2026-12-28","2a","Hverdag, morgen 0600 - 0800",null,null,null,null,null,null,0]
[12,"2026-12-28","1a","Hverdag, kveld 1600 - 2200",null,null,null,null,null,null,0]
[12,"2026-12-28","4a","Natt hverdag 2200 - 2400",null,null,null,null,null,null,0]
[12,"2026-12-29","4b","Natt hverdag 0000 - 0600",null,null,null,null,null,null,0]
[12,"2026-12-29","2a","Hverdag, morgen 0600 - 0800",null,null,null,null,null,null,0]
[12,"2026-12-29","1a","Hverdag, kveld 1600 - 2200",null,null,null,null,null,null,0]
[12,"2026-12-29","4a",{"$f":"IF(C1346=\"\",\"\",VLOOKUP(C1346,Vaktperioder,2,0))","v":"Natt hverdag 2200 - 2400"},null,null,null,null,null,null,0]
[{"$f":"IF(B1347=\"\",\"\",MONTH(B1347))","v":12},"2026-12-30","4b","Natt hverdag 0000 - 0600",null,null,null,null,null,null,0]
[12,"2026-12-30","2a","Hverdag, morgen 0600 - 0800",null,null,null,null,null,null,0]
[12,"2026-12-30","1a","Hverdag, kveld 1600 - 2200",null,null,null,null,null,null,0]
[12,"2026-12-30","4a","Natt hverdag 2200 - 2400",null,null,null,null,null,null,0]
[12,"2026-12-31","4b","Natt hverdag 0000 - 0600",null,null,null,null,null,null,{"$f":"IF(C1350=\"3d\",IF(C1351=\"4e\",0,1),0)","v":0}]
[12,"2026-12-31","3c","Jul- og nyttårsaften 0600 - 1200",null,null,null,null,null,null,{"$f":"IF(C1351=\"3d\",IF(C1352=\"4e\",0,1),0)","v":0}]
[12,"2026-12-31","3d","Påske-, jul- og nyttårsaften 1200 - 2200",null,null,null,null,null,null,{"$f":"IF(C1352=\"3d\",IF(C1353=\"4e\",0,1),0)","v":0}]
[12,"2026-12-31","4e","Natt hellig- og høytidsdag 2200 - 2400",null,null,null,null,null,null,{"$f":"IF(C1353=\"3d\",IF(C1354=\"4e\",0,1),0)","v":0}]
["",null,null,""]
[]
[]
["X",null,"Vaktperiode",null,"Ordinær","Sesong","Vakans"]
[{"$f":"$A$2","v":1},null,"1a"]
[null,"Dato     ",{"$f":"C1359","v":"1a"},{"$f":"VLOOKUP(C1359,Vaktperioder,2,0)","v":"Hverdag, kveld 1600 - 2200"},{"$f":"DCOUNTA(Vaktliste,E$5,$A1358:$G1359)","v":0},{"$f":"DCOUNTA(Vaktliste,F$5,$A1358:$G1359)","v":0},{"$f":"DCOUNTA(Vaktliste,G$5,$A1358:$G1359)","v":0},{"$f":"IF(C1360=\"ny1a\",E1363*Vaktperiode!#REF!*Vaktperiode!#REF!+F1363*Vaktperiode!#REF!*Vaktperiode!#REF!+G1363*Vaktperiode!#REF!*Vaktperiode!#REF!,E1360*Vaktperiode!D2*Vaktperiode!C2+F1360*Vaktperiode!E2*Vaktperiode!C2+G1360*Vaktperiode!F2*Vaktperiode!C2)","v":0}]
["X",null,"Vaktperiode",null,"Ordinær","Sesong","Vakans"]
[{"$f":"$A$2","v":1},null,"2a"]
[null,"Dato     ",{"$f":"C1362","v":"2a"},{"$f":"VLOOKUP(C1362,Vaktperioder,2,0)","v":"Hverdag, morgen 0600 - 0800"},{"$f":"DCOUNTA(Vaktliste,E$5,$A1361:$G1362)","v":0},{"$f":"DCOUNTA(Vaktliste,F$5,$A1361:$G1362)","v":0},{"$f":"DCOUNTA(Vaktliste,G$5,$A1361:$G1362)","v":0},{"$f":"IF(C1363=\"ny2a\",E1363*Vaktperiode!#REF!*Vaktperiode!#REF!+F1363*Vaktperiode!#REF!*Vaktperiode!#REF!+G1363*Vaktperiode!#REF!*Vaktperiode!#REF!,E1363*Vaktperiode!D3*Vaktperiode!C3+F1363*Vaktperiode!E3*Vaktperiode!C3+G1363*Vaktperiode!F3*Vaktperiode!C3)","v":0}]
["X",null,"Vaktperiode",null,"Ordinær","Sesong","Vakans"]
[{"$f":"$A$2","v":1},null,"3a"]
[null,"Dato     ",{"$f":"C1365","v":"3a"},{"$f":"VLOOKUP(C1365,Vaktperioder,2,0)","v":"Lørdag, søndag 0600 - 2200"},{"$f":"DCOUNTA(Vaktliste,E$5,$A1364:$G1365)","v":0},{"$f":"DCOUNTA(Vaktliste,F$5,$A1364:$G1365)","v":0},{"$f":"DCOUNTA(Vaktliste,G$5,$A1364:$G1365)","v":0},{"$f":"IF(C1366=\"ny3a\",E1366*Vaktperiode!#REF!*Vaktperiode!#REF!+F1366*Vaktperiode!#REF!*Vaktperiode!#REF!+G1366*Vaktperiode!#REF!*Vaktperiode!#REF!,E1366*Vaktperiode!D4*Vaktperiode!C4+F1366*Vaktperiode!E4*Vaktperiode!C4+G1366*Vaktperiode!F4*Vaktperiode!C4)","v":0}]
["X",null,"Vaktperiode",null,"Ordinær","Sesong","Vakans"]
[{"$f":"$A$2","v":1},null,"3b"]
[null,"Dato     ",{"$f":"C1368","v":"3b"},{"$f":"VLOOKUP(C1368,Vaktperioder,2,0)","v":"Hellig- og høytidsdag 0600 - 2200"},{"$f":"DCOUNTA(Vaktliste,E$5,$A1367:$G1368)","v":0},{"$f":"DCOUNTA(Vaktliste,F$5,$A1367:$G1368)","v":0},{"$f":"DCOUNTA(Vaktliste,G$5,$A1367:$G1368)","v":0},{"$f":"IF(C1369=\"ny3b\",E1369*Vaktperiode!#REF!*Vaktperiode!#REF!+F1369*Vaktperiode!#REF!*Vaktperiode!#REF!+G1369*Vaktperiode!#REF!*Vaktperiode!#REF!,E1369*Vaktperiode!D5*Vaktperiode!C5+F1369*Vaktperiode!E5*Vaktperiode!C5+G1369*Vaktperiode!F5*Vaktperiode!C5)","v":0}]
["X",null,"Vaktperiode",null,"Ordinær","Sesong","Vakans"]
[{"$f":"$A$2","v":1},null,"3c"]
[null,"Dato     ",{"$f":"C1371","v":"3c"},{"$f":"VLOOKUP(C1371,Vaktperioder,2,0)","v":"Jul- og nyttårsaften 0600 - 1200"},{"$f":"DCOUNTA(Vaktliste,E$5,$A1370:$G1371)","v":0},{"$f":"DCOUNTA(Vaktliste,F$5,$A1370:$G1371)","v":0},{"$f":"DCOUNTA(Vaktliste,G$5,$A1370:$G1371)","v":0},{"$f":"IF(C1372=\"ny3c\",E1372*Vaktperiode!#REF!*Vaktperiode!#REF!+F1372*Vaktperiode!#REF!*Vaktperiode!#REF!+G1372*Vaktperiode!#REF!*Vaktperiode!#REF!,E1372*Vaktperiode!D6*Vaktperiode!C6+F1372*Vaktperiode!E6*Vaktperiode!C6+G1372*Vaktperiode!F6*Vaktperiode!C6)","v":0}]
["X",null,"Vaktperiode",null,"Ordinær","Sesong","Vakans"]
[{"$f":"$A$2","v":1},null,"3d"]
[null,"Dato     ",{"$f":"C1374","v":"3d"},{"$f":"VLOOKUP(C1374,Vaktperioder,2,0)","v":"Påske-, jul- og nyttårsaften 1200 - 2200"},{"$f":"DCOUNTA(Vaktliste,E$5,$A1373:$G1374)","v":0},{"$f":"DCOUNTA(Vaktliste,F$5,$A1373:$G1374)","v":0},{"$f":"DCOUNTA(Vaktliste,G$5,$A1373:$G1374)","v":0},{"$f":"IF(C1375=\"ny3d\",E1375*Vaktperiode!#REF!*Vaktperiode!#REF!+F1375*Vaktperiode!#REF!*Vaktperiode!#REF!+G1375*Vaktperiode!#REF!*Vaktperiode!#REF!,E1375*Vaktperiode!D7*Vaktperiode!C7+F1375*Vaktperiode!E7*Vaktperiode!C7+G1375*Vaktperiode!F7*Vaktperiode!C7)","v":0}]
["X",null,"Vaktperiode",null,"Ordinær","Sesong","Vakans"]
[{"$f":"$A$2","v":1},null,"3e"]
[null,"Dato     ",{"$f":"C1377","v":"3e"},{"$f":"VLOOKUP(C1377,Vaktperioder,2,0)","v":"Påskeaften 0600 - 1200"},{"$f":"DCOUNTA(Vaktliste,E$5,$A1376:$G1377)","v":0},{"$f":"DCOUNTA(Vaktliste,F$5,$A1376:$G1377)","v":0},{"$f":"DCOUNTA(Vaktliste,G$5,$A1376:$G1377)","v":0},{"$f":"IF(C1378=\"ny3d\",E1378*Vaktperiode!#REF!*Vaktperiode!#REF!+F1378*Vaktperiode!#REF!*Vaktperiode!#REF!+G1378*Vaktperiode!#REF!*Vaktperiode!#REF!,E1378*Vaktperiode!D8*Vaktperiode!C8+F1378*Vaktperiode!E8*Vaktperiode!C8+G1378*Vaktperiode!F8*Vaktperiode!C8)","v":0}]
["X",null,"Vaktperiode",null,"Ordinær","Sesong","Vakans"]
[{"$f":"$A$2","v":1},null,"4a"]
[null,"Dato     ",{"$f":"C1380","v":"4a"},{"$f":"VLOOKUP(C1380,Vaktperioder,2,0)","v":"Natt hverdag 2200 - 2400"},{"$f":"DCOUNTA(Vaktliste,E$5,$A1379:$G1380)","v":0},{"$f":"DCOUNTA(Vaktliste,F$5,$A1379:$G1380)","v":0},{"$f":"DCOUNTA(Vaktliste,G$5,$A1379:$G1380)","v":0},{"$f":"IF(C1381=\"ny4a\",E1381*Vaktperiode!#REF!*Vaktperiode!#REF!+F1381*Vaktperiode!#REF!*Vaktperiode!#REF!+G1381*Vaktperiode!#REF!*Vaktperiode!#REF!,E1381*Vaktperiode!D9*Vaktperiode!C9+F1381*Vaktperiode!E9*Vaktperiode!C9+G1381*Vaktperiode!F9*Vaktperiode!C9)","v":0}]
["X",null,"Vaktperiode",null,"Ordinær","Sesong","Vakans"]
[{"$f":"$A$2","v":1},null,"4b"]
[null,"Dato     ",{"$f":"C1383","v":"4b"},{"$f":"VLOOKUP(C1383,Vaktperioder,2,0)","v":"Natt hverdag 0000 - 0600"},{"$f":"DCOUNTA(Vaktliste,E$5,$A1382:$G1383)","v":0},{"$f":"DCOUNTA(Vaktliste,F$5,$A1382:$G1383)","v":0},{"$f":"DCOUNTA(Vaktliste,G$5,$A1382:$G1383)","v":0},{"$f":"IF(C1384=\"ny4b\",E1384*Vaktperiode!#REF!*Vaktperiode!#REF!+F1384*Vaktperiode!#REF!*Vaktperiode!#REF!+G1384*Vaktperiode!#REF!*Vaktperiode!#REF!,E1384*Vaktperiode!D10*Vaktperiode!C10+F1384*Vaktperiode!E10*Vaktperiode!C10+G1384*Vaktperiode!F10*Vaktperiode!C10)","v":0}]
["X",null,"Vaktperiode",null,"Ordinær","Sesong","Vakans"]
[{"$f":"$A$2","v":1},null,"4c"]
[null,"Dato     ",{"$f":"C1386","v":"4c"},{"$f":"VLOOKUP(C1386,Vaktperioder,2,0)","v":"Natt lørdag, søndag 2200 - 2400"},{"$f":"DCOUNTA(Vaktliste,E$5,$A1385:$G1386)","v":0},{"$f":"DCOUNTA(Vaktliste,F$5,$A1385:$G1386)","v":0},{"$f":"DCOUNTA(Vaktliste,G$5,$A1385:$G1386)","v":0},{"$f":"IF(C1387=\"ny4c\",E1387*Vaktperiode!#REF!*Vaktperiode!#REF!+F1387*Vaktperiode!#REF!*Vaktperiode!#REF!+G1387*Vaktperiode!#REF!*Vaktperiode!#REF!,E1387*Vaktperiode!D11*Vaktperiode!C11+F1387*Vaktperiode!E11*Vaktperiode!C11+G1387*Vaktperiode!F11*Vaktperiode!C11)","v":0}]
["X",null,"Vaktperiode",null,"Ordinær","Sesong","Vakans"]
[{"$f":"$A$2","v":1},null,"4d"]
[null,"Dato     ",{"$f":"C1389","v":"4d"},{"$f":"VLOOKUP(C1389,Vaktperioder,2,0)","v":"Natt lørdag, søndag 0000 - 0600"},{"$f":"DCOUNTA(Vaktliste,E$5,$A1388:$G1389)","v":0},{"$f":"DCOUNTA(Vaktliste,F$5,$A1388:$G1389)","v":0},{"$f":"DCOUNTA(Vaktliste,G$5,$A1388:$G1389)","v":0},{"$f":"IF(C1390=\"ny4d\",E1390*Vaktperiode!#REF!*Vaktperiode!#REF!+F1390*Vaktperiode!#REF!*Vaktperiode!#REF!+G1390*Vaktperiode!#REF!*Vaktperiode!#REF!,E1390*Vaktperiode!D12*Vaktperiode!C12+F1390*Vaktperiode!E12*Vaktperiode!C12+G1390*Vaktperiode!F12*Vaktperiode!C12)","v":0}]
["X",null,"Vaktperiode",null,"Ordinær","Sesong","Vakans"]
[{"$f":"$A$2","v":1},null,"4e"]
[null,"Dato     ",{"$f":"C1392","v":"4e"},{"$f":"VLOOKUP(C1392,Vaktperioder,2,0)","v":"Natt hellig- og høytidsdag 2200 - 2400"},{"$f":"DCOUNTA(Vaktliste,E$5,$A1391:$G1392)","v":0},{"$f":"DCOUNTA(Vaktliste,F$5,$A1391:$G1392)","v":0},{"$f":"DCOUNTA(Vaktliste,G$5,$A1391:$G1392)","v":0},{"$f":"IF(C1393=\"ny4e\",E1393*Vaktperiode!#REF!*Vaktperiode!#REF!+F1393*Vaktperiode!#REF!*Vaktperiode!#REF!+G1393*Vaktperiode!#REF!*Vaktperiode!#REF!,E1393*Vaktperiode!D13*Vaktperiode!C13+F1393*Vaktperiode!E13*Vaktperiode!C13+G1393*Vaktperiode!F13*Vaktperiode!C13)","v":0}]
["X",null,"Vaktperiode",null,"Ordinær","Sesong","Vakans"]
[{"$f":"$A$2","v":1},null,"4f"]
[null,"Dato     ",{"$f":"C1395","v":"4f"},{"$f":"VLOOKUP(C1395,Vaktperioder,2,0)","v":"Natt hellig- og høytidsdag 0000 - 0600"},{"$f":"DCOUNTA(Vaktliste,E$5,$A1394:$G1395)","v":0},{"$f":"DCOUNTA(Vaktliste,F$5,$A1394:$G1395)","v":0},{"$f":"DCOUNTA(Vaktliste,G$5,$A1394:$G1395)","v":0},{"$f":"IF(C1396=\"ny4f\",E1396*Vaktperiode!#REF!*Vaktperiode!#REF!+F1396*Vaktperiode!#REF!*Vaktperiode!#REF!+G1396*Vaktperiode!#REF!*Vaktperiode!#REF!,E1396*Vaktperiode!D14*Vaktperiode!C14+F1396*Vaktperiode!E14*Vaktperiode!C14+G1396*Vaktperiode!F14*Vaktperiode!C14)","v":0}]
[null,null,null,"Kontrollsum",{"$f":"SUM(E1360,E1363,E1366,E1369,E1372,E1375,E1378,E1381,E1384,E1387,E1390,E1393,E1396)","v":0},{"$f":"SUM(F1360,F1363,F1366,F1369,F1372,F1375,F1378,F1381,F1384,F1387,F1390,F1393,F1396)","v":0},{"$f":"SUM(G1360,G1363,G1366,G1369,G1372,G1375,G1378,G1381,G1384,G1387,G1390,G1393,G1396)","v":0},{"$f":"SUM(H1360,H1363,H1366,H1369,H1372,H1375,H1378,H1381,H1384,H1387,H1390,H1393,H1396)","v":0}]
[]
[null,"Sum antall vakter pr veterinær"]
[1,{"$f":"'nn (1)'!C$14","v":"nn1"},null,{"$f":"'nn (1)'!C$4","v":0},{"$f":"'nn (1)'!D151","v":0},{"$f":"'nn (1)'!E151","v":0},{"$f":"'nn (1)'!F151","v":0},{"$f":"'nn (1)'!H151","v":0}]
[2,{"$f":"'nn (2)'!C$14","v":"nn2"},null,{"$f":"'nn (2)'!C$4","v":0},{"$f":"'nn (2)'!D151","v":0},{"$f":"'nn (2)'!E151","v":0},{"$f":"'nn (2)'!F151","v":0},{"$f":"'nn (2)'!H151","v":0}]
[3,{"$f":"'nn (3)'!C$14","v":"nn3"},null,{"$f":"'nn (3)'!C$4","v":0},{"$f":"'nn (3)'!D151","v":0},{"$f":"'nn (3)'!E151","v":0},{"$f":"'nn (3)'!F151","v":0},{"$f":"'nn (3)'!H151","v":0}]
[4,{"$f":"'nn (4)'!C$14","v":"nn4"},null,{"$f":"'nn (4)'!C$4","v":0},{"$f":"'nn (4)'!D151","v":0},{"$f":"'nn (4)'!E151","v":0},{"$f":"'nn (4)'!F151","v":0},{"$f":"'nn (4)'!H151","v":0}]
[5,{"$f":"'nn (5)'!C$14","v":"nn5"},null,{"$f":"'nn (5)'!C$4","v":0},{"$f":"'nn (5)'!D151","v":0},{"$f":"'nn (5)'!E151","v":0},{"$f":"'nn (5)'!F151","v":0},{"$f":"'nn (5)'!H151","v":0}]
[6,{"$f":"'nn (6)'!C$14","v":"nn6"},null,{"$f":"'nn (6)'!C$4","v":0},{"$f":"'nn (6)'!D151","v":0},{"$f":"'nn (6)'!E151","v":0},{"$f":"'nn (6)'!F151","v":0},{"$f":"'nn (6)'!H151","v":0}]
[7,{"$f":"'nn (7)'!C$14","v":"nn7"},null,{"$f":"'nn (7)'!C$4","v":0},{"$f":"'nn (7)'!D151","v":0},{"$f":"'nn (7)'!E151","v":0},{"$f":"'nn (7)'!F151","v":0},{"$f":"'nn (7)'!H151","v":0}]
[8,{"$f":"'nn (8)'!C$14","v":"nn8"},null,{"$f":"'nn (8)'!C$4","v":0},{"$f":"'nn (8)'!D151","v":0},{"$f":"'nn (8)'!E151","v":0},{"$f":"'nn (8)'!F151","v":0},{"$f":"'nn (8)'!H151","v":0}]
[9,{"$f":"'nn (9)'!C$14","v":"nn9"},null,{"$f":"'nn (9)'!C$4","v":0},{"$f":"'nn (9)'!D151","v":0},{"$f":"'nn (9)'!E151","v":0},{"$f":"'nn (9)'!F151","v":0},{"$f":"'nn (9)'!H151","v":0}]
[10,{"$f":"'nn (10)'!C$14","v":"nn0"},null,{"$f":"'nn (10)'!C$4","v":0},{"$f":"'nn (10)'!D151","v":0},{"$f":"'nn (10)'!E151","v":0},{"$f":"'nn (10)'!F151","v":0},{"$f":"'nn (10)'!H151","v":0}]
[null,null,null,"Kontrollsum",{"$f":"SUM(E1400:E1409)","v":0},{"$f":"SUM(F1400:F1409)","v":0},{"$f":"SUM(G1400:G1409)","v":0},{"$f":"SUM(H1400:H1409)","v":0}]
[]
[null,null,null,"Veterinær","Kontortelefon",null,"Mobiltelefon"]
[null,null,null,{"$f":"'nn (1)'!C$14","v":"nn1"}]
[null,null,null,{"$f":"'nn (2)'!C$14","v":"nn2"}]
[null,null,null,{"$f":"'nn (3)'!C$14","v":"nn3"}]
[null,null,null,{"$f":"'nn (4)'!C$14","v":"nn4"}]
[null,null,null,{"$f":"'nn (5)'!C$14","v":"nn5"}]
[null,null,null,{"$f":"'nn (6)'!C$14","v":"nn6"}]
[null,null,null,{"$f":"'nn (7)'!C$14","v":"nn7"}]
[null,null,null,{"$f":"'nn (8)'!C$14","v":"nn8"}]
[null,null,null,{"$f":"'nn (9)'!C$14","v":"nn9"}]
[null,null,null,{"$f":"'nn (10)'!C$14","v":"nn0"}]

{"sheet":"nn (1)","index":1,"n_rows":151,"n_cols":8,"rows_kept":151,"cut":false,"hidden":false,"merged":[[139,1,139,2],[139,5,139,6],[146,1,146,2],[146,5,146,6],[147,1,147,2],[147,5,147,6],[150,5,150,6],[148,1,148,2],[148,5,148,6],[149,1,149,2],[149,5,149,6],[136,1,136,2],[136,5,136,6],[29,5,29,6],[36,5,36,6],[37,5,37,6],[137,1,137,2],[137,5,137,6],[138,1,138,2],[138,5,138,6],[38,5,38,6],[59,5,59,6],[66,5,66,6],[67,5,67,6],[68,5,68,6],[56,5,56,6],[57,5,57,6],[58,5,58,6],[117,5,117,6],[118,5,118,6],[89,5,89,6],[96,5,96,6],[97,5,97,6],[98,5,98,6],[69,5,69,6],[19,5,19,6],[26,5,26,6],[27,5,27,6],[28,5,28,6],[49,5,49,6],[11,3,11,4],[3,2,3,6],[17,3,17,6],[16,3,16,6],[7,2,7,6],[39,5,39,6],[46,5,46,6],[47,5,47,6],[48,5,48,6],[12,2,12,6],[47,1,47,2],[48,1,48,2],[49,1,49,2],[26,1,26,2],[27,1,27,2],[28,1,28,2],[29,1,29,2],[36,1,36,2],[37,1,37,2],[56,1,56,2],[77,1,77,2],[78,1,78,2],[79,1,79,2],[57,1,57,2],[58,1,58,2],[59,1,59,2],[66,1,66,2],[68,1,68,2],[69,1,69,2],[67,1,67,2],[76,1,76,2],[76,5,76,6],[77,5,77,6],[78,5,78,6],[79,5,79,6],[87,1,87,2],[88,1,88,2],[89,1,89,2],[129,5,129,6],[119,5,119,6],[126,5,126,6],[99,5,99,6],[106,5,106,6],[107,5,107,6],[108,5,108,6],[96,1,96,2],[109,5,109,6],[116,5,116,6],[86,1,86,2],[86,5,86,6],[87,5,87,6],[38,1,38,2],[39,1,39,2],[46,1,46,2],[129,1,129,2],[9,2,9,4],[5,2,5,6],[13,2,13,3],[119,1,119,2],[126,1,126,2],[127,1,127,2],[128,1,128,2],[109,1,109,2],[118,1,118,2],[97,1,97,2],[98,1,98,2],[116,1,116,2],[117,1,117,2],[99,1,99,2],[106,1,106,2],[107,1,107,2],[108,1,108,2],[127,5,127,6],[128,5,128,6],[88,5,88,6]]}
[null,"REGNING"]
[null,"GODTGJØRING FOR DELTAKELSE I KLINISK VETERINÆRVAKT"]
[]
[null,"Navn:",null,null,null,null,null,"Fakturadato:"]
[null,null,null,null,null,null,null,"Forfallsdato:"]
[null,"Adresse:"]
[]
[null,"Postnummer, -sted:"]
[]
[null,"Bankgirokontonr:"]
[]
[null,"Organisasjonsnummer:","NO",null,null,"MVA"]
[null,"Fullt navn:"]
[null,"Initialer:","nn1"]
[null,"Regningen gjelder vakttjeneste i vaktområdet (jfr. vaktliste):"]
[null,{"$f":"Vaktliste!E1","v":"Primært vaktområde"}]
[null,"for perioden:"]
[null,{"$f":"Vaktliste!B3","v":"2026-01-01"},null,{"$f":"Vaktliste!E4","v":0}]
[]
[null,"Vakttype - antall vakter",null,"Ordinær","Sesong","Vakans",null,"Beløp"]
["X","Vaktperiode",null,"Ordinær"]
[{"$f":"Vaktliste!$A$2","v":1},"1a",null,{"$f":"$C$14","v":"nn1"}]
["X","Vaktperiode",null,null,"Sesong"]
[{"$f":"Vaktliste!$A$2","v":1},{"$f":"B22","v":"1a"},null,null,{"$f":"$C$14","v":"nn1"}]
["X","Vaktperiode",null,null,null,null,"Vakans"]
[{"$f":"Vaktliste!$A$2","v":1},{"$f":"B24","v":"1a"},null,null,null,null,{"$f":"$C$14","v":"nn1"}]
["X",{"$f":"VLOOKUP(B22,Vaktperioder,2,0)","v":"Hverdag, kveld 1600 - 2200"},null,{"$f":"DCOUNTA(Vaktliste,5,$A21:$G22)","v":0},{"$f":"DCOUNTA(Vaktliste,6,$A23:$G24)","v":0},{"$f":"DCOUNTA(Vaktliste,7,$A25:$G26)","v":0}]
[{"$f":"Vaktliste!$A$2","v":1},"Timer",null,{"$f":"D27*DGET(Timer,3,$B21:$B22)","v":0},{"$f":"E27*DGET(Timer,3,$B21:$B22)","v":0},{"$f":"F27*DGET(Timer,3,B21:B22)","v":0}]
["X","Satser",null,{"$f":"IF(D28>0,DGET(Vaktperiode0,D$20,$B21:$B22),0)","v":0},{"$f":"IF(E28>0,DGET(Vaktperiode0,E$20,$B21:$B22),0)","v":0},{"$f":"IF(F28>0,DGET(Vaktperiode0,F$20,$B21:$B22),0)","v":0}]
[{"$f":"Vaktliste!$A$2","v":1},"Beløp",null,{"$f":"D29*D28","v":0},{"$f":"E29*E28","v":0},{"$f":"F29*F28","v":0},null,{"$f":"SUM(D30:F30)","v":0}]
["X","Vaktperiode",null,"Ordinær"]
[{"$f":"Vaktliste!$A$2","v":1},"2a",null,{"$f":"$C$14","v":"nn1"}]
["X","Vaktperiode",null,null,"Sesong"]
[{"$f":"Vaktliste!$A$2","v":1},{"$f":"B32","v":"2a"},null,null,{"$f":"$C$14","v":"nn1"}]
["X","Vaktperiode",null,null,null,null,"Vakans"]
[{"$f":"Vaktliste!$A$2","v":1},{"$f":"B34","v":"2a"},null,null,null,null,{"$f":"$C$14","v":"nn1"}]
["X",{"$f":"VLOOKUP(B32,Vaktperioder,2,0)","v":"Hverdag, morgen 0600 - 0800"},null,{"$f":"DCOUNTA(Vaktliste,5,$A31:$G32)","v":0},{"$f":"DCOUNTA(Vaktliste,6,$A33:$G34)","v":0},{"$f":"DCOUNTA(Vaktliste,7,$A35:$G36)","v":0}]
[{"$f":"Vaktliste!$A$2","v":1},"Timer",null,{"$f":"D37*DGET(Timer,3,$B31:$B32)","v":0},{"$f":"E37*DGET(Timer,3,$B31:$B32)","v":0},{"$f":"F37*DGET(Timer,3,B31:B32)","v":0}]
["X","Satser",null,{"$f":"IF(D38>0,DGET(Vaktperiode0,D$20,$B31:$B32),0)","v":0},{"$f":"IF(E38>0,DGET(Vaktperiode0,E$20,$B31:$B32),0)","v":0},{"$f":"IF(F38>0,DGET(Vaktperiode0,F$20,$B31:$B32),0)","v":0}]
[{"$f":"Vaktliste!$A$2","v":1},"Beløp",null,{"$f":"D39*D38","v":0},{"$f":"E39*E38","v":0},{"$f":"F39*F38","v":0},null,{"$f":"SUM(D40:F40)","v":0}]
["X","Vaktperiode",null,"Ordinær"]
[{"$f":"Vaktliste!$A$2","v":1},"3a",null,{"$f":"$C$14","v":"nn1"}]
["X","Vaktperiode",null,null,"Sesong"]
[{"$f":"Vaktliste!$A$2","v":1},{"$f":"B42","v":"3a"},null,null,{"$f":"$C$14","v":"nn1"}]
["X","Vaktperiode",null,null,null,null,"Vakans"]
[{"$f":"Vaktliste!$A$2","v":1},{"$f":"B44","v":"3a"},null,null,null,null,{"$f":"$C$14","v":"nn1"}]
["X",{"$f":"VLOOKUP(B42,Vaktperioder,2,0)","v":"Lørdag, søndag 0600 - 2200"},null,{"$f":"DCOUNTA(Vaktliste,5,$A41:$G42)","v":0},{"$f":"DCOUNTA(Vaktliste,6,$A43:$G44)","v":0},{"$f":"DCOUNTA(Vaktliste,7,$A45:$G46)","v":0}]
[{"$f":"Vaktliste!$A$2","v":1},"Timer",null,{"$f":"D47*DGET(Timer,3,$B41:$B42)","v":0},{"$f":"E47*DGET(Timer,3,$B41:$B42)","v":0},{"$f":"F47*DGET(Timer,3,B41:B42)","v":0}]
["X","Satser",null,{"$f":"IF(D48>0,DGET(Vaktperiode0,D$20,$B41:$B42),0)","v":0},{"$f":"IF(E48>0,DGET(Vaktperiode0,E$20,$B41:$B42),0)","v":0},{"$f":"IF(F48>0,DGET(Vaktperiode0,F$20,$B41:$B42),0)","v":0}]
[{"$f":"Vaktliste!$A$2","v":1},"Beløp",null,{"$f":"D49*D48","v":0},{"$f":"E49*E48","v":0},{"$f":"F49*F48","v":0},null,{"$f":"SUM(D50:F50)","v":0}]
["X","Vaktperiode",null,"Ordinær"]
[{"$f":"Vaktliste!$A$2","v":1},"3b",null,{"$f":"$C$14","v":"nn1"}]
["X","Vaktperiode",null,null,"Sesong"]
[{"$f":"Vaktliste!$A$2","v":1},{"$f":"B52","v":"3b"},null,null,{"$f":"$C$14","v":"nn1"}]
["X","Vaktperiode",null,null,null,null,"Vakans"]
[{"$f":"Vaktliste!$A$2","v":1},{"$f":"B54","v":"3b"},null,null,null,null,{"$f":"$C$14","v":"nn1"}]
["X",{"$f":"VLOOKUP(B52,Vaktperioder,2,0)","v":"Hellig- og høytidsdag 0600 - 2200"},null,{"$f":"DCOUNTA(Vaktliste,5,$A51:$G52)","v":0},{"$f":"DCOUNTA(Vaktliste,6,$A53:$G54)","v":0},{"$f":"DCOUNTA(Vaktliste,7,$A55:$G56)","v":0}]
[{"$f":"Vaktliste!$A$2","v":1},"Timer",null,{"$f":"D57*DGET(Timer,3,$B51:$B52)","v":0},{"$f":"E57*DGET(Timer,3,$B51:$B52)","v":0},{"$f":"F57*DGET(Timer,3,B51:B52)","v":0}]
["X","Satser",null,{"$f":"IF(D58>0,DGET(Vaktperiode0,D$20,$B51:$B52),0)","v":0},{"$f":"IF(E58>0,DGET(Vaktperiode0,E$20,$B51:$B52),0)","v":0},{"$f":"IF(F58>0,DGET(Vaktperiode0,F$20,$B51:$B52),0)","v":0}]
[{"$f":"Vaktliste!$A$2","v":1},"Beløp",null,{"$f":"D59*D58","v":0},{"$f":"E59*E58","v":0},{"$f":"F59*F58","v":0},null,{"$f":"SUM(D60:F60)","v":0}]
["X","Vaktperiode",null,"Ordinær"]
[{"$f":"Vaktliste!$A$2","v":1},"3c",null,{"$f":"$C$14","v":"nn1"}]
["X","Vaktperiode",null,null,"Sesong"]
[{"$f":"Vaktliste!$A$2","v":1},{"$f":"B62","v":"3c"},null,null,{"$f":"$C$14","v":"nn1"}]
["X","Vaktperiode",null,null,null,null,"Vakans"]
[{"$f":"Vaktliste!$A$2","v":1},{"$f":"B64","v":"3c"},null,null,null,null,{"$f":"$C$14","v":"nn1"}]
["X",{"$f":"VLOOKUP(B62,Vaktperioder,2,0)","v":"Jul- og nyttårsaften 0600 - 1200"},null,{"$f":"DCOUNTA(Vaktliste,5,$A61:$G62)","v":0},{"$f":"DCOUNTA(Vaktliste,6,$A63:$G64)","v":0},{"$f":"DCOUNTA(Vaktliste,7,$A65:$G66)","v":0}]
[{"$f":"Vaktliste!$A$2","v":1},"Timer",null,{"$f":"D67*DGET(Timer,3,$B61:$B62)","v":0},{"$f":"E67*DGET(Timer,3,$B61:$B62)","v":0},{"$f":"F67*DGET(Timer,3,B61:B62)","v":0}]
["X","Satser",null,{"$f":"IF(D68>0,DGET(Vaktperiode0,D$20,$B61:$B62),0)","v":0},{"$f":"IF(E68>0,DGET(Vaktperiode0,E$20,$B61:$B62),0)","v":0},{"$f":"IF(F68>0,DGET(Vaktperiode0,F$20,$B61:$B62),0)","v":0}]
[{"$f":"Vaktliste!$A$2","v":1},"Beløp",null,{"$f":"D69*D68","v":0},{"$f":"E69*E68","v":0},{"$f":"F69*F68","v":0},null,{"$f":"SUM(D70:F70)","v":0}]
["X","Vaktperiode",null,"Ordinær"]
[{"$f":"Vaktliste!$A$2","v":1},"3d",null,{"$f":"$C$14","v":"nn1"}]
["X","Vaktperiode",null,null,"Sesong"]
[{"$f":"Vaktliste!$A$2","v":1},{"$f":"B72","v":"3d"},null,null,{"$f":"$C$14","v":"nn1"}]
["X","Vaktperiode",null,null,null,null,"Vakans"]
[{"$f":"Vaktliste!$A$2","v":1},{"$f":"B74","v":"3d"},null,null,null,null,{"$f":"$C$14","v":"nn1"}]
["X",{"$f":"VLOOKUP(B72,Vaktperioder,2,0)","v":"Påske-, jul- og nyttårsaften 1200 - 2200"},null,{"$f":"DCOUNTA(Vaktliste,5,$A71:$G72)","v":0},{"$f":"DCOUNTA(Vaktliste,6,$A73:$G74)","v":0},{"$f":"DCOUNTA(Vaktliste,7,$A75:$G76)","v":0}]
[{"$f":"Vaktliste!$A$2","v":1},"Timer",null,{"$f":"D77*DGET(Timer,3,$B71:$B72)","v":0},{"$f":"E77*DGET(Timer,3,$B71:$B72)","v":0},{"$f":"F77*DGET(Timer,3,B71:B72)","v":0}]
["X","Satser",null,{"$f":"IF(D78>0,DGET(Vaktperiode0,D$20,$B71:$B72),0)","v":0},{"$f":"IF(E78>0,DGET(Vaktperiode0,E$20,$B71:$B72),0)","v":0},{"$f":"IF(F78>0,DGET(Vaktperiode0,F$20,$B71:$B72),0)","v":0}]
[{"$f":"Vaktliste!$A$2","v":1},"Beløp",null,{"$f":"D79*D78","v":0},{"$f":"E79*E78","v":0},{"$f":"F79*F78","v":0},null,{"$f":"SUM(D80:F80)","v":0}]
["X","Vaktperiode",null,"Ordinær"]
[{"$f":"Vaktliste!$A$2","v":1},"3e",null,{"$f":"$C$14","v":"nn1"}]
["X","Vaktperiode",null,null,"Sesong"]
[{"$f":"Vaktliste!$A$2","v":1},{"$f":"B82","v":"3e"},null,null,{"$f":"$C$14","v":"nn1"}]
["X","Vaktperiode",null,null,null,null,"Vakans"]
[{"$f":"Vaktliste!$A$2","v":1},{"$f":"B84","v":"3e"},null,null,null,null,{"$f":"$C$14","v":"nn1"}]
["X",{"$f":"VLOOKUP(B82,Vaktperioder,2,0)","v":"Påskeaften 0600 - 1200"},null,{"$f":"DCOUNTA(Vaktliste,5,$A81:$G82)","v":0},{"$f":"DCOUNTA(Vaktliste,6,$A83:$G84)","v":0},{"$f":"DCOUNTA(Vaktliste,7,$A85:$G86)","v":0}]
[{"$f":"Vaktliste!$A$2","v":1},"Timer",null,{"$f":"D87*DGET(Timer,3,$B81:$B82)","v":0},{"$f":"E87*DGET(Timer,3,$B81:$B82)","v":0},{"$f":"F87*DGET(Timer,3,B81:B82)","v":0}]
["X","Satser",null,{"$f":"IF(D88>0,DGET(Vaktperiode0,D$20,$B81:$B82),0)","v":0},{"$f":"IF(E88>0,DGET(Vaktperiode0,E$20,$B81:$B82),0)","v":0},{"$f":"IF(F88>0,DGET(Vaktperiode0,F$20,$B81:$B82),0)","v":0}]
[{"$f":"Vaktliste!$A$2","v":1},"Beløp",null,{"$f":"D89*D88","v":0},{"$f":"E89*E88","v":0},{"$f":"F89*F88","v":0},null,{"$f":"SUM(D90:F90)","v":0}]
["X","Vaktperiode",null,"Ordinær"]
[{"$f":"Vaktliste!$A$2","v":1},"4a",null,{"$f":"$C$14","v":"nn1"}]
["X","Vaktperiode",null,null,"Sesong"]
[{"$f":"Vaktliste!$A$2","v":1},{"$f":"B92","v":"4a"},null,null,{"$f":"$C$14","v":"nn1"}]
["X","Vaktperiode",null,null,null,null,"Vakans"]
[{"$f":"Vaktliste!$A$2","v":1},{"$f":"B94","v":"4a"},null,null,null,null,{"$f":"$C$14","v":"nn1"}]
["X",{"$f":"VLOOKUP(B92,Vaktperioder,2,0)","v":"Natt hverdag 2200 - 2400"},null,{"$f":"DCOUNTA(Vaktliste,5,$A91:$G92)","v":0},{"$f":"DCOUNTA(Vaktliste,6,$A93:$G94)","v":0},{"$f":"DCOUNTA(Vaktliste,7,$A95:$G96)","v":0}]
[{"$f":"Vaktliste!$A$2","v":1},"Timer",null,{"$f":"D97*DGET(Timer,3,$B91:$B92)","v":0},{"$f":"E97*DGET(Timer,3,$B91:$B92)","v":0},{"$f":"F97*DGET(Timer,3,B91:B92)","v":0}]
["X","Satser",null,{"$f":"IF(D98>0,DGET(Vaktperiode0,D$20,$B91:$B92),0)","v":0},{"$f":"IF(E98>0,DGET(Vaktperiode0,E$20,$B91:$B92),0)","v":0},{"$f":"IF(F98>0,DGET(Vaktperiode0,F$20,$B91:$B92),0)","v":0}]
[{"$f":"Vaktliste!$A$2","v":1},"Beløp",null,{"$f":"D99*D98","v":0},{"$f":"E99*E98","v":0},{"$f":"F99*F98","v":0},null,{"$f":"SUM(D100:F100)","v":0}]
["X","Vaktperiode",null,"Ordinær"]
[{"$f":"Vaktliste!$A$2","v":1},"4b",null,{"$f":"$C$14","v":"nn1"}]
["X","Vaktperiode",null,null,"Sesong"]
[{"$f":"Vaktliste!$A$2","v":1},{"$f":"B102","v":"4b"},null,null,{"$f":"$C$14","v":"nn1"}]
["X","Vaktperiode",null,null,null,null,"Vakans"]
[{"$f":"Vaktliste!$A$2","v":1},{"$f":"B104","v":"4b"},null,null,null,null,{"$f":"$C$14","v":"nn1"}]
["X",{"$f":"VLOOKUP(B102,Vaktperioder,2,0)","v":"Natt hverdag 0000 - 0600"},null,{"$f":"DCOUNTA(Vaktliste,5,$A101:$G102)","v":0},{"$f":"DCOUNTA(Vaktliste,6,$A103:$G104)","v":0},{"$f":"DCOUNTA(Vaktliste,7,$A105:$G106)","v":0}]
[{"$f":"Vaktliste!$A$2","v":1},"Timer",null,{"$f":"D107*DGET(Timer,3,$B101:$B102)","v":0},{"$f":"E107*DGET(Timer,3,$B101:$B102)","v":0},{"$f":"F107*DGET(Timer,3,B101:B102)","v":0}]
["X","Satser",null,{"$f":"IF(D108>0,DGET(Vaktperiode0,D$20,$B101:$B102),0)","v":0},{"$f":"IF(E108>0,DGET(Vaktperiode0,E$20,$B101:$B102),0)","v":0},{"$f":"IF(F108>0,DGET(Vaktperiode0,F$20,$B101:$B102),0)","v":0}]
[{"$f":"Vaktliste!$A$2","v":1},"Beløp",null,{"$f":"D109*D108","v":0},{"$f":"E109*E108","v":0},{"$f":"F109*F108","v":0},null,{"$f":"SUM(D110:F110)","v":0}]
["X","Vaktperiode",null,"Ordinær"]
[{"$f":"Vaktliste!$A$2","v":1},"4c",null,{"$f":"$C$14","v":"nn1"}]
["X","Vaktperiode",null,null,"Sesong"]
[{"$f":"Vaktliste!$A$2","v":1},{"$f":"B112","v":"4c"},null,null,{"$f":"$C$14","v":"nn1"}]
["X","Vaktperiode",null,null,null,null,"Vakans"]
[{"$f":"Vaktliste!$A$2","v":1},{"$f":"B114","v":"4c"},null,null,null,null,{"$f":"$C$14","v":"nn1"}]
["X",{"$f":"VLOOKUP(B112,Vaktperioder,2,0)","v":"Natt lørdag, søndag 2200 - 2400"},null,{"$f":"DCOUNTA(Vaktliste,5,$A111:$G112)","v":0},{"$f":"DCOUNTA(Vaktliste,6,$A113:$G114)","v":0},{"$f":"DCOUNTA(Vaktliste,7,$A115:$G116)","v":0}]
[{"$f":"Vaktliste!$A$2","v":1},"Timer",null,{"$f":"D117*DGET(Timer,3,$B111:$B112)","v":0},{"$f":"E117*DGET(Timer,3,$B111:$B112)","v":0},{"$f":"F117*DGET(Timer,3,B111:B112)","v":0}]
["X","Satser",null,{"$f":"IF(D118>0,DGET(Vaktperiode0,D$20,$B111:$B112),0)","v":0},{"$f":"IF(E118>0,DGET(Vaktperiode0,E$20,$B111:$B112),0)","v":0},{"$f":"IF(F118>0,DGET(Vaktperiode0,F$20,$B111:$B112),0)","v":0}]
[{"$f":"Vaktliste!$A$2","v":1},"Beløp",null,{"$f":"D119*D118","v":0},{"$f":"E119*E118","v":0},{"$f":"F119*F118","v":0},null,{"$f":"SUM(D120:F120)","v":0}]
["X","Vaktperiode",null,"Ordinær"]
[{"$f":"Vaktliste!$A$2","v":1},"4d",null,{"$f":"$C$14","v":"nn1"}]
["X","Vaktperiode",null,null,"Sesong"]
[{"$f":"Vaktliste!$A$2","v":1},{"$f":"B122","v":"4d"},null,null,{"$f":"$C$14","v":"nn1"}]
["X","Vaktperiode",null,null,null,null,"Vakans"]
[{"$f":"Vaktliste!$A$2","v":1},{"$f":"B124","v":"4d"},null,null,null,null,{"$f":"$C$14","v":"nn1"}]
["X",{"$f":"VLOOKUP(B122,Vaktperioder,2,0)","v":"Natt lørdag, søndag 0000 - 0600"},null,{"$f":"DCOUNTA(Vaktliste,5,$A121:$G122)","v":0},{"$f":"DCOUNTA(Vaktliste,6,$A123:$G124)","v":0},{"$f":"DCOUNTA(Vaktliste,7,$A125:$G126)","v":0}]
[{"$f":"Vaktliste!$A$2","v":1},"Timer",null,{"$f":"D127*DGET(Timer,3,$B121:$B122)","v":0},{"$f":"E127*DGET(Timer,3,$B121:$B122)","v":0},{"$f":"F127*DGET(Timer,3,B121:B122)","v":0}]
["X","Satser",null,{"$f":"IF(D128>0,DGET(Vaktperiode0,D$20,$B121:$B122),0)","v":0},{"$f":"IF(E128>0,DGET(Vaktperiode0,E$20,$B121:$B122),0)","v":0},{"$f":"IF(F128>0,DGET(Vaktperiode0,F$20,$B121:$B122),0)","v":0}]
[{"$f":"Vaktliste!$A$2","v":1},"Beløp",null,{"$f":"D129*D128","v":0},{"$f":"E129*E128","v":0},{"$f":"F129*F128","v":0},null,{"$f":"SUM(D130:F130)","v":0}]
["X","Vaktperiode",null,"Ordinær"]
[{"$f":"Vaktliste!$A$2","v":1},"4e",null,{"$f":"$C$14","v":"nn1"}]
["X","Vaktperiode",null,null,"Sesong"]
[{"$f":"Vaktliste!$A$2","v":1},{"$f":"B132","v":"4e"},null,null,{"$f":"$C$14","v":"nn1"}]
["X","Vaktperiode",null,null,null,null,"Vakans"]
[{"$f":"Vaktliste!$A$2","v":1},{"$f":"B134","v":"4e"},null,null,null,null,{"$f":"$C$14","v":"nn1"}]
["X",{"$f":"VLOOKUP(B132,Vaktperioder,2,0)","v":"Natt hellig- og høytidsdag 2200 - 2400"},null,{"$f":"DCOUNTA(Vaktliste,5,$A131:$G132)","v":0},{"$f":"DCOUNTA(Vaktliste,6,$A133:$G134)","v":0},{"$f":"DCOUNTA(Vaktliste,7,$A135:$G136)","v":0}]
[{"$f":"Vaktliste!$A$2","v":1},"Timer",null,{"$f":"D137*DGET(Timer,3,$B131:$B132)","v":0},{"$f":"E137*DGET(Timer,3,$B131:$B132)","v":0},{"$f":"F137*DGET(Timer,3,B131:B132)","v":0}]
["X","Satser",null,{"$f":"IF(D138>0,DGET(Vaktperiode0,D$20,$B131:$B132),0)","v":0},{"$f":"IF(E138>0,DGET(Vaktperiode0,E$20,$B131:$B132),0)","v":0},{"$f":"IF(F138>0,DGET(Vaktperiode0,F$20,$B131:$B132),0)","v":0}]
[{"$f":"Vaktliste!$A$2","v":1},"Beløp",null,{"$f":"D139*D138","v":0},{"$f":"E139*E138","v":0},{"$f":"F139*F138","v":0},null,{"$f":"SUM(D140:F140)","v":0}]
["X","Vaktperiode",null,"Ordinær"]
[{"$f":"Vaktliste!$A$2","v":1},"4f",null,{"$f":"$C$14","v":"nn1"}]
["X","Vaktperiode",null,null,"Sesong"]
[{"$f":"Vaktliste!$A$2","v":1},{"$f":"B142","v":"4f"},null,null,{"$f":"$C$14","v":"nn1"}]
["X","Vaktperiode",null,null,null,null,"Vakans"]
[{"$f":"Vaktliste!$A$2","v":1},{"$f":"B144","v":"4f"},null,null,null,null,{"$f":"$C$14","v":"nn1"}]
["X",{"$f":"VLOOKUP(B142,Vaktperioder,2,0)","v":"Natt hellig- og høytidsdag 0000 - 0600"},null,{"$f":"DCOUNTA(Vaktliste,5,$A141:$G142)","v":0},{"$f":"DCOUNTA(Vaktliste,6,$A143:$G144)","v":0},{"$f":"DCOUNTA(Vaktliste,7,$A145:$G146)","v":0}]
[{"$f":"Vaktliste!$A$2","v":1},"Timer",null,{"$f":"D147*DGET(Timer,3,$B141:$B142)","v":0},{"$f":"E147*DGET(Timer,3,$B141:$B142)","v":0},{"$f":"F147*DGET(Timer,3,B141:B142)","v":0}]
["X","Satser",null,{"$f":"IF(D148>0,DGET(Vaktperiode0,D$20,$B141:$B142),0)","v":0},{"$f":"IF(E148>0,DGET(Vaktperiode0,E$20,$B141:$B142),0)","v":0},{"$f":"IF(F148>0,DGET(Vaktperiode0,F$20,$B141:$B142),0)","v":0}]
[{"$f":"Vaktliste!$A$2","v":1},"Beløp",null,{"$f":"D149*D148","v":0},{"$f":"E149*E148","v":0},{"$f":"F149*F148","v":0},null,{"$f":"SUM(D150:F150)","v":0}]
[null,"Sum antall vakter / beløp",null,{"$f":"D28+D38+D48+D58+D68+D78+D88+D98+D108+D118+D128+D138+D148","v":0},{"$f":"E28+E38+E48+E58+E68+E78+E88+E98+E108+E118+E128+E138+E148","v":0},{"$f":"F28+F38+F48+F58+F68+F78+F88+F98+F108+F118+F128+F138+F148","v":0},null,{"$f":"SUM(H27:H150)","v":0}]

{"sheet":"nn (2)","index":2,"n_rows":151,"n_cols":8,"rows_kept":151,"cut":false,"hidden":false,"merged":[[139,1,139,2],[139,5,139,6],[146,1,146,2],[146,5,146,6],[147,1,147,2],[147,5,147,6],[150,5,150,6],[148,1,148,2],[148,5,148,6],[149,1,149,2],[149,5,149,6],[128,1,128,2],[128,5,128,6],[129,1,129,2],[129,5,129,6],[136,1,136,2],[136,5,136,6],[137,1,137,2],[137,5,137,6],[138,1,138,2],[138,5,138,6],[7,2,7,6],[11,3,11,4],[16,3,16,6],[17,3,17,6],[12,2,12,6],[126,1,126,2],[126,5,126,6],[127,1,127,2],[127,5,127,6],[36,1,36,2],[36,5,36,6],[37,1,37,2],[37,5,37,6],[28,1,28,2],[28,5,28,6],[29,1,29,2],[29,5,29,6],[19,5,19,6],[26,1,26,2],[26,5,26,6],[27,1,27,2],[27,5,27,6],[48,1,48,2],[48,5,48,6],[49,1,49,2],[49,5,49,6],[46,1,46,2],[46,5,46,6],[47,1,47,2],[47,5,47,6],[38,1,38,2],[38,5,38,6],[39,1,39,2],[39,5,39,6],[66,1,66,2],[66,5,66,6],[67,1,67,2],[67,5,67,6],[58,1,58,2],[58,5,58,6],[59,1,59,2],[59,5,59,6],[56,1,56,2],[56,5,56,6],[57,1,57,2],[57,5,57,6],[78,1,78,2],[78,5,78,6],[79,1,79,2],[79,5,79,6],[76,1,76,2],[76,5,76,6],[77,1,77,2],[77,5,77,6],[68,1,68,2],[68,5,68,6],[69,1,69,2],[69,5,69,6],[96,1,96,2],[96,5,96,6],[97,1,97,2],[97,5,97,6],[88,1,88,2],[88,5,88,6],[89,1,89,2],[89,5,89,6],[86,1,86,2],[86,5,86,6],[87,1,87,2],[87,5,87,6],[119,1,119,2],[119,5,119,6],[3,2,3,6],[5,2,5,6],[9,2,9,4],[13,2,13,3],[117,1,117,2],[117,5,117,6],[118,1,118,2],[108,1,108,2],[108,5,108,6],[118,5,118,6],[109,1,109,2],[109,5,109,6],[116,1,116,2],[116,5,116,6],[106,1,106,2],[106,5,106,6],[107,1,107,2],[107,5,107,6],[98,1,98,2],[98,5,98,6],[99,1,99,2],[99,5,99,6]]}
[null,"REGNING"]
[null,"GODTGJØRING FOR DELTAKELSE I KLINISK VETERINÆRVAKT"]
[]
[null,"Navn:",null,null,null,null,null,"Fakturadato:"]
[null,null,null,null,null,null,null,"Forfallsdato:"]
[null,"Adresse:"]
[]
[null,"Postnummer, -sted:"]
[]
[null,"Bankgirokontonr:"]
[]
[null,"Organisasjonsnummer:","NO",null,null,"MVA"]
[null,"Fullt navn:"]
[null,"Initialer:","nn2"]
[null,"Regningen gjelder vakttjeneste i vaktområdet (jfr. vaktliste):"]
[null,{"$f":"Vaktliste!E1","v":"Primært vaktområde"}]
[null,"for perioden:"]
[null,{"$f":"Vaktliste!B3","v":"2026-01-01"},null,{"$f":"Vaktliste!E4","v":0}]
[]
[null,"Vakttype - antall vakter",null,"Ordinær","Sesong","Vakans",null,"Beløp"]
["X","Vaktperiode",null,"Ordinær"]
[{"$f":"Vaktliste!$A$2","v":1},"1a",null,{"$f":"$C$14","v":"nn2"}]
["X","Vaktperiode",null,null,"Sesong"]
[{"$f":"Vaktliste!$A$2","v":1},{"$f":"B22","v":"1a"},null,null,{"$f":"$C$14","v":"nn2"}]
["X","Vaktperiode",null,null,null,null,"Vakans"]
[{"$f":"Vaktliste!$A$2","v":1},{"$f":"B24","v":"1a"},null,null,null,null,{"$f":"$C$14","v":"nn2"}]
["X",{"$f":"VLOOKUP(B22,Vaktperioder,2,0)","v":"Hverdag, kveld 1600 - 2200"},null,{"$f":"DCOUNTA(Vaktliste,5,$A21:$G22)","v":0},{"$f":"DCOUNTA(Vaktliste,6,$A23:$G24)","v":0},{"$f":"DCOUNTA(Vaktliste,7,$A25:$G26)","v":0}]
[{"$f":"Vaktliste!$A$2","v":1},"Timer",null,{"$f":"D27*DGET(Timer,3,$B21:$B22)","v":0},{"$f":"E27*DGET(Timer,3,$B21:$B22)","v":0},{"$f":"F27*DGET(Timer,3,B21:B22)","v":0}]
["X","Satser",null,{"$f":"IF(D28>0,DGET(Vaktperiode0,D$20,$B21:$B22),0)","v":0},{"$f":"IF(E28>0,DGET(Vaktperiode0,E$20,$B21:$B22),0)","v":0},{"$f":"IF(F28>0,DGET(Vaktperiode0,F$20,$B21:$B22),0)","v":0}]
[{"$f":"Vaktliste!$A$2","v":1},"Beløp",null,{"$f":"D29*D28","v":0},{"$f":"E29*E28","v":0},{"$f":"F29*F28","v":0},null,{"$f":"SUM(D30:F30)","v":0}]
["X","Vaktperiode",null,"Ordinær"]
[{"$f":"Vaktliste!$A$2","v":1},"2a",null,{"$f":"$C$14","v":"nn2"}]
["X","Vaktperiode",null,null,"Sesong"]
[{"$f":"Vaktliste!$A$2","v":1},{"$f":"B32","v":"2a"},null,null,{"$f":"$C$14","v":"nn2"}]
["X","Vaktperiode",null,null,null,null,"Vakans"]
[{"$f":"Vaktliste!$A$2","v":1},{"$f":"B34","v":"2a"},null,null,null,null,{"$f":"$C$14","v":"nn2"}]
["X",{"$f":"VLOOKUP(B32,Vaktperioder,2,0)","v":"Hverdag, morgen 0600 - 0800"},null,{"$f":"DCOUNTA(Vaktliste,5,$A31:$G32)","v":0},{"$f":"DCOUNTA(Vaktliste,6,$A33:$G34)","v":0},{"$f":"DCOUNTA(Vaktliste,7,$A35:$G36)","v":0}]
[{"$f":"Vaktliste!$A$2","v":1},"Timer",null,{"$f":"D37*DGET(Timer,3,$B31:$B32)","v":0},{"$f":"E37*DGET(Timer,3,$B31:$B32)","v":0},{"$f":"F37*DGET(Timer,3,B31:B32)","v":0}]
["X","Satser",null,{"$f":"IF(D38>0,DGET(Vaktperiode0,D$20,$B31:$B32),0)","v":0},{"$f":"IF(E38>0,DGET(Vaktperiode0,E$20,$B31:$B32),0)","v":0},{"$f":"IF(F38>0,DGET(Vaktperiode0,F$20,$B31:$B32),0)","v":0}]
[{"$f":"Vaktliste!$A$2","v":1},"Beløp",null,{"$f":"D39*D38","v":0},{"$f":"E39*E38","v":0},{"$f":"F39*F38","v":0},null,{"$f":"SUM(D40:F40)","v":0}]
["X","Vaktperiode",null,"Ordinær"]
[{"$f":"Vaktliste!$A$2","v":1},"3a",null,{"$f":"$C$14","v":"nn2"}]
["X","Vaktperiode",null,null,"Sesong"]
[{"$f":"Vaktliste!$A$2","v":1},{"$f":"B42","v":"3a"},null,null,{"$f":"$C$14","v":"nn2"}]
["X","Vaktperiode",null,null,null,null,"Vakans"]
[{"$f":"Vaktliste!$A$2","v":1},{"$f":"B44","v":"3a"},null,null,null,null,{"$f":"$C$14","v":"nn2"}]
["X",{"$f":"VLOOKUP(B42,Vaktperioder,2,0)","v":"Lørdag, søndag 0600 - 2200"},null,{"$f":"DCOUNTA(Vaktliste,5,$A41:$G42)","v":0},{"$f":"DCOUNTA(Vaktliste,6,$A43:$G44)","v":0},{"$f":"DCOUNTA(Vaktliste,7,$A45:$G46)","v":0}]
[{"$f":"Vaktliste!$A$2","v":1},"Timer",null,{"$f":"D47*DGET(Timer,3,$B41:$B42)","v":0},{"$f":"E47*DGET(Timer,3,$B41:$B42)","v":0},{"$f":"F47*DGET(Timer,3,B41:B42)","v":0}]
["X","Satser",null,{"$f":"IF(D48>0,DGET(Vaktperiode0,D$20,$B41:$B42),0)","v":0},{"$f":"IF(E48>0,DGET(Vaktperiode0,E$20,$B41:$B42),0)","v":0},{"$f":"IF(F48>0,DGET(Vaktperiode0,F$20,$B41:$B42),0)","v":0}]
[{"$f":"Vaktliste!$A$2","v":1},"Beløp",null,{"$f":"D49*D48","v":0},{"$f":"E49*E48","v":0},{"$f":"F49*F48","v":0},null,{"$f":"SUM(D50:F50)","v":0}]
["X","Vaktperiode",null,"Ordinær"]
[{"$f":"Vaktliste!$A$2","v":1},"3b",null,{"$f":"$C$14","v":"nn2"}]
["X","Vaktperiode",null,null,"Sesong"]
[{"$f":"Vaktliste!$A$2","v":1},{"$f":"B52","v":"3b"},null,null,{"$f":"$C$14","v":"nn2"}]
["X","Vaktperiode",null,null,null,null,"Vakans"]
[{"$f":"Vaktliste!$A$2","v":1},{"$f":"B54","v":"3b"},null,null,null,null,{"$f":"$C$14","v":"nn2"}]
["X",{"$f":"VLOOKUP(B52,Vaktperioder,2,0)","v":"Hellig- og høytidsdag 0600 - 2200"},null,{"$f":"DCOUNTA(Vaktliste,5,$A51:$G52)","v":0},{"$f":"DCOUNTA(Vaktliste,6,$A53:$G54)","v":0},{"$f":"DCOUNTA(Vaktliste,7,$A55:$G56)","v":0}]
[{"$f":"Vaktliste!$A$2","v":1},"Timer",null,{"$f":"D57*DGET(Timer,3,$B51:$B52)","v":0},{"$f":"E57*DGET(Timer,3,$B51:$B52)","v":0},{"$f":"F57*DGET(Timer,3,B51:B52)","v":0}]
["X","Satser",null,{"$f":"IF(D58>0,DGET(Vaktperiode0,D$20,$B51:$B52),0)","v":0},{"$f":"IF(E58>0,DGET(Vaktperiode0,E$20,$B51:$B52),0)","v":0},{"$f":"IF(F58>0,DGET(Vaktperiode0,F$20,$B51:$B52),0)","v":0}]
[{"$f":"Vaktliste!$A$2","v":1},"Beløp",null,{"$f":"D59*D58","v":0},{"$f":"E59*E58","v":0},{"$f":"F59*F58","v":0},null,{"$f":"SUM(D60:F60)","v":0}]
["X","Vaktperiode",null,"Ordinær"]
[{"$f":"Vaktliste!$A$2","v":1},"3c",null,{"$f":"$C$14","v":"nn2"}]
["X","Vaktperiode",null,null,"Sesong"]
[{"$f":"Vaktliste!$A$2","v":1},{"$f":"B62","v":"3c"},null,null,{"$f":"$C$14","v":"nn2"}]
["X","Vaktperiode",null,null,null,null,"Vakans"]
[{"$f":"Vaktliste!$A$2","v":1},{"$f":"B64","v":"3c"},null,null,null,null,{"$f":"$C$14","v":"nn2"}]
["X",{"$f":"VLOOKUP(B62,Vaktperioder,2,0)","v":"Jul- og nyttårsaften 0600 - 1200"},null,{"$f":"DCOUNTA(Vaktliste,5,$A61:$G62)","v":0},{"$f":"DCOUNTA(Vaktliste,6,$A63:$G64)","v":0},{"$f":"DCOUNTA(Vaktliste,7,$A65:$G66)","v":0}]
[{"$f":"Vaktliste!$A$2","v":1},"Timer",null,{"$f":"D67*DGET(Timer,3,$B61:$B62)","v":0},{"$f":"E67*DGET(Timer,3,$B61:$B62)","v":0},{"$f":"F67*DGET(Timer,3,B61:B62)","v":0}]
["X","Satser",null,{"$f":"IF(D68>0,DGET(Vaktperiode0,D$20,$B61:$B62),0)","v":0},{"$f":"IF(E68>0,DGET(Vaktperiode0,E$20,$B61:$B62),0)","v":0},{"$f":"IF(F68>0,DGET(Vaktperiode0,F$20,$B61:$B62),0)","v":0}]
[{"$f":"Vaktliste!$A$2","v":1},"Beløp",null,{"$f":"D69*D68","v":0},{"$f":"E69*E68","v":0},{"$f":"F69*F68","v":0},null,{"$f":"SUM(D70:F70)","v":0}]
["X","Vaktperiode",null,"Ordinær"]
[{"$f":"Vaktliste!$A$2","v":1},"3d",null,{"$f":"$C$14","v":"nn2"}]
["X","Vaktperiode",null,null,"Sesong"]
[{"$f":"Vaktliste!$A$2","v":1},{"$f":"B72","v":"3d"},null,null,{"$f":"$C$14","v":"nn2"}]
["X","Vaktperiode",null,null,null,null,"Vakans"]
[{"$f":"Vaktliste!$A$2","v":1},{"$f":"B74","v":"3d"},null,null,null,null,{"$f":"$C$14","v":"nn2"}]
["X",{"$f":"VLOOKUP(B72,Vaktperioder,2,0)","v":"Påske-, jul- og nyttårsaften 1200 - 2200"},null,{"$f":"DCOUNTA(Vaktliste,5,$A71:$G72)","v":0},{"$f":"DCOUNTA(Vaktliste,6,$A73:$G74)","v":0},{"$f":"DCOUNTA(Vaktliste,7,$A75:$G76)","v":0}]
[{"$f":"Vaktliste!$A$2","v":1},"Timer",null,{"$f":"D77*DGET(Timer,3,$B71:$B72)","v":0},{"$f":"E77*DGET(Timer,3,$B71:$B72)","v":0},{"$f":"F77*DGET(Timer,3,B71:B72)","v":0}]
["X","Satser",null,{"$f":"IF(D78>0,DGET(Vaktperiode0,D$20,$B71:$B72),0)","v":0},{"$f":"IF(E78>0,DGET(Vaktperiode0,E$20,$B71:$B72),0)","v":0},{"$f":"IF(F78>0,DGET(Vaktperiode0,F$20,$B71:$B72),0)","v":0}]
[{"$f":"Vaktliste!$A$2","v":1},"Beløp",null,{"$f":"D79*D78","v":0},{"$f":"E79*E78","v":0},{"$f":"F79*F78","v":0},null,{"$f":"SUM(D80:F80)","v":0}]
["X","Vaktperiode",null,"Ordinær"]
[{"$f":"Vaktliste!$A$2","v":1},"3e",null,{"$f":"$C$14","v":"nn2"}]
["X","Vaktperiode",null,null,"Sesong"]
[{"$f":"Vaktliste!$A$2","v":1},{"$f":"B82","v":"3e"},null,null,{"$f":"$C$14","v":"nn2"}]
["X","Vaktperiode",null,null,null,null,"Vakans"]
[{"$f":"Vaktliste!$A$2","v":1},{"$f":"B84","v":"3e"},null,null,null,null,{"$f":"$C$14","v":"nn2"}]
["X",{"$f":"VLOOKUP(B82,Vaktperioder,2,0)","v":"Påskeaften 0600 - 1200"},null,{"$f":"DCOUNTA(Vaktliste,5,$A81:$G82)","v":0},{"$f":"DCOUNTA(Vaktliste,6,$A83:$G84)","v":0},{"$f":"DCOUNTA(Vaktliste,7,$A85:$G86)","v":0}]
[{"$f":"Vaktliste!$A$2","v":1},"Timer",null,{"$f":"D87*DGET(Timer,3,$B81:$B82)","v":0},{"$f":"E87*DGET(Timer,3,$B81:$B82)","v":0},{"$f":"F87*DGET(Timer,3,B81:B82)","v":0}]
["X","Satser",null,{"$f":"IF(D88>0,DGET(Vaktperiode0,D$20,$B81:$B82),0)","v":0},{"$f":"IF(E88>0,DGET(Vaktperiode0,E$20,$B81:$B82),0)","v":0},{"$f":"IF(F88>0,DGET(Vaktperiode0,F$20,$B81:$B82),0)","v":0}]
[{"$f":"Vaktliste!$A$2","v":1},"Beløp",null,{"$f":"D89*D88","v":0},{"$f":"E89*E88","v":0},{"$f":"F89*F88","v":0},null,{"$f":"SUM(D90:F90)","v":0}]
["X","Vaktperiode",null,"Ordinær"]
[{"$f":"Vaktliste!$A$2","v":1},"4a",null,{"$f":"$C$14","v":"nn2"}]
["X","Vaktperiode",null,null,"Sesong"]
[{"$f":"Vaktliste!$A$2","v":1},{"$f":"B92","v":"4a"},null,null,{"$f":"$C$14","v":"nn2"}]
["X","Vaktperiode",null,null,null,null,"Vakans"]
[{"$f":"Vaktliste!$A$2","v":1},{"$f":"B94","v":"4a"},null,null,null,null,{"$f":"$C$14","v":"nn2"}]
["X",{"$f":"VLOOKUP(B92,Vaktperioder,2,0)","v":"Natt hverdag 2200 - 2400"},null,{"$f":"DCOUNTA(Vaktliste,5,$A91:$G92)","v":0},{"$f":"DCOUNTA(Vaktliste,6,$A93:$G94)","v":0},{"$f":"DCOUNTA(Vaktliste,7,$A95:$G96)","v":0}]
[{"$f":"Vaktliste!$A$2","v":1},"Timer",null,{"$f":"D97*DGET(Timer,3,$B91:$B92)","v":0},{"$f":"E97*DGET(Timer,3,$B91:$B92)","v":0},{"$f":"F97*DGET(Timer,3,B91:B92)","v":0}]
["X","Satser",null,{"$f":"IF(D98>0,DGET(Vaktperiode0,D$20,$B91:$B92),0)","v":0},{"$f":"IF(E98>0,DGET(Vaktperiode0,E$20,$B91:$B92),0)","v":0},{"$f":"IF(F98>0,DGET(Vaktperiode0,F$20,$B91:$B92),0)","v":0}]
[{"$f":"Vaktliste!$A$2","v":1},"Beløp",null,{"$f":"D99*D98","v":0},{"$f":"E99*E98","v":0},{"$f":"F99*F98","v":0},null,{"$f":"SUM(D100:F100)","v":0}]
["X","Vaktperiode",null,"Ordinær"]
[{"$f":"Vaktliste!$A$2","v":1},"4b",null,{"$f":"$C$14","v":"nn2"}]
["X","Vaktperiode",null,null,"Sesong"]
[{"$f":"Vaktliste!$A$2","v":1},{"$f":"B102","v":"4b"},null,null,{"$f":"$C$14","v":"nn2"}]
["X","Vaktperiode",null,null,null,null,"Vakans"]
[{"$f":"Vaktliste!$A$2","v":1},{"$f":"B104","v":"4b"},null,null,null,null,{"$f":"$C$14","v":"nn2"}]
["X",{"$f":"VLOOKUP(B102,Vaktperioder,2,0)","v":"Natt hverdag 0000 - 0600"},null,{"$f":"DCOUNTA(Vaktliste,5,$A101:$G102)","v":0},{"$f":"DCOUNTA(Vaktliste,6,$A103:$G104)","v":0},{"$f":"DCOUNTA(Vaktliste,7,$A105:$G106)","v":0}]
[{"$f":"Vaktliste!$A$2","v":1},"Timer",null,{"$f":"D107*DGET(Timer,3,$B101:$B102)","v":0},{"$f":"E107*DGET(Timer,3,$B101:$B102)","v":0},{"$f":"F107*DGET(Timer,3,B101:B102)","v":0}]
["X","Satser",null,{"$f":"IF(D108>0,DGET(Vaktperiode0,D$20,$B101:$B102),0)","v":0},{"$f":"IF(E108>0,DGET(Vaktperiode0,E$20,$B101:$B102),0)","v":0},{"$f":"IF(F108>0,DGET(Vaktperiode0,F$20,$B101:$B102),0)","v":0}]
[{"$f":"Vaktliste!$A$2","v":1},"Beløp",null,{"$f":"D109*D108","v":0},{"$f":"E109*E108","v":0},{"$f":"F109*F108","v":0},null,{"$f":"SUM(D110:F110)","v":0}]
["X","Vaktperiode",null,"Ordinær"]
[{"$f":"Vaktliste!$A$2","v":1},"4c",null,{"$f":"$C$14","v":"nn2"}]
["X","Vaktperiode",null,null,"Sesong"]
[{"$f":"Vaktliste!$A$2","v":1},{"$f":"B112","v":"4c"},null,null,{"$f":"$C$14","v":"nn2"}]
["X","Vaktperiode",null,null,null,null,"Vakans"]
[{"$f":"Vaktliste!$A$2","v":1},{"$f":"B114","v":"4c"},null,null,null,null,{"$f":"$C$14","v":"nn2"}]
["X",{"$f":"VLOOKUP(B112,Vaktperioder,2,0)","v":"Natt lørdag, søndag 2200 - 2400"},null,{"$f":"DCOUNTA(Vaktliste,5,$A111:$G112)","v":0},{"$f":"DCOUNTA(Vaktliste,6,$A113:$G114)","v":0},{"$f":"DCOUNTA(Vaktliste,7,$A115:$G116)","v":0}]
[{"$f":"Vaktliste!$A$2","v":1},"Timer",null,{"$f":"D117*DGET(Timer,3,$B111:$B112)","v":0},{"$f":"E117*DGET(Timer,3,$B111:$B112)","v":0},{"$f":"F117*DGET(Timer,3,B111:B112)","v":0}]
["X","Satser",null,{"$f":"IF(D118>0,DGET(Vaktperiode0,D$20,$B111:$B112),0)","v":0},{"$f":"IF(E118>0,DGET(Vaktperiode0,E$20,$B111:$B112),0)","v":0},{"$f":"IF(F118>0,DGET(Vaktperiode0,F$20,$B111:$B112),0)","v":0}]
[{"$f":"Vaktliste!$A$2","v":1},"Beløp",null,{"$f":"D119*D118","v":0},{"$f":"E119*E118","v":0},{"$f":"F119*F118","v":0},null,{"$f":"SUM(D120:F120)","v":0}]
["X","Vaktperiode",null,"Ordinær"]
[{"$f":"Vaktliste!$A$2","v":1},"4d",null,{"$f":"$C$14","v":"nn2"}]
["X","Vaktperiode",null,null,"Sesong"]
[{"$f":"Vaktliste!$A$2","v":1},{"$f":"B122","v":"4d"},null,null,{"$f":"$C$14","v":"nn2"}]
["X","Vaktperiode",null,null,null,null,"Vakans"]
[{"$f":"Vaktliste!$A$2","v":1},{"$f":"B124","v":"4d"},null,null,null,null,{"$f":"$C$14","v":"nn2"}]
["X",{"$f":"VLOOKUP(B122,Vaktperioder,2,0)","v":"Natt lørdag, søndag 0000 - 0600"},null,{"$f":"DCOUNTA(Vaktliste,5,$A121:$G122)","v":0},{"$f":"DCOUNTA(Vaktliste,6,$A123:$G124)","v":0},{"$f":"DCOUNTA(Vaktliste,7,$A125:$G126)","v":0}]
[{"$f":"Vaktliste!$A$2","v":1},"Timer",null,{"$f":"D127*DGET(Timer,3,$B121:$B122)","v":0},{"$f":"E127*DGET(Timer,3,$B121:$B122)","v":0},{"$f":"F127*DGET(Timer,3,B121:B122)","v":0}]
["X","Satser",null,{"$f":"IF(D128>0,DGET(Vaktperiode0,D$20,$B121:$B122),0)","v":0},{"$f":"IF(E128>0,DGET(Vaktperiode0,E$20,$B121:$B122),0)","v":0},{"$f":"IF(F128>0,DGET(Vaktperiode0,F$20,$B121:$B122),0)","v":0}]
[{"$f":"Vaktliste!$A$2","v":1},"Beløp",null,{"$f":"D129*D128","v":0},{"$f":"E129*E128","v":0},{"$f":"F129*F128","v":0},null,{"$f":"SUM(D130:F130)","v":0}]
["X","Vaktperiode",null,"Ordinær"]
[{"$f":"Vaktliste!$A$2","v":1},"4e",null,{"$f":"$C$14","v":"nn2"}]
["X","Vaktperiode",null,null,"Sesong"]
[{"$f":"Vaktliste!$A$2","v":1},{"$f":"B132","v":"4e"},null,null,{"$f":"$C$14","v":"nn2"}]
["X","Vaktperiode",null,null,null,null,"Vakans"]
[{"$f":"Vaktliste!$A$2","v":1},{"$f":"B134","v":"4e"},null,null,null,null,{"$f":"$C$14","v":"nn2"}]
["X",{"$f":"VLOOKUP(B132,Vaktperioder,2,0)","v":"Natt hellig- og høytidsdag 2200 - 2400"},null,{"$f":"DCOUNTA(Vaktliste,5,$A131:$G132)","v":0},{"$f":"DCOUNTA(Vaktliste,6,$A133:$G134)","v":0},{"$f":"DCOUNTA(Vaktliste,7,$A135:$G136)","v":0}]
[{"$f":"Vaktliste!$A$2","v":1},"Timer",null,{"$f":"D137*DGET(Timer,3,$B131:$B132)","v":0},{"$f":"E137*DGET(Timer,3,$B131:$B132)","v":0},{"$f":"F137*DGET(Timer,3,B131:B132)","v":0}]
["X","Satser",null,{"$f":"IF(D138>0,DGET(Vaktperiode0,D$20,$B131:$B132),0)","v":0},{"$f":"IF(E138>0,DGET(Vaktperiode0,E$20,$B131:$B132),0)","v":0},{"$f":"IF(F138>0,DGET(Vaktperiode0,F$20,$B131:$B132),0)","v":0}]
[{"$f":"Vaktliste!$A$2","v":1},"Beløp",null,{"$f":"D139*D138","v":0},{"$f":"E139*E138","v":0},{"$f":"F139*F138","v":0},null,{"$f":"SUM(D140:F140)","v":0}]
["X","Vaktperiode",null,"Ordinær"]
[{"$f":"Vaktliste!$A$2","v":1},"4f",null,{"$f":"$C$14","v":"nn2"}]
["X","Vaktperiode",null,null,"Sesong"]
[{"$f":"Vaktliste!$A$2","v":1},{"$f":"B142","v":"4f"},null,null,{"$f":"$C$14","v":"nn2"}]
["X","Vaktperiode",null,null,null,null,"Vakans"]
[{"$f":"Vaktliste!$A$2","v":1},{"$f":"B144","v":"4f"},null,null,null,null,{"$f":"$C$14","v":"nn2"}]
["X",{"$f":"VLOOKUP(B142,Vaktperioder,2,0)","v":"Natt hellig- og høytidsdag 0000 - 0600"},null,{"$f":"DCOUNTA(Vaktliste,5,$A141:$G142)","v":0},{"$f":"DCOUNTA(Vaktliste,6,$A143:$G144)","v":0},{"$f":"DCOUNTA(Vaktliste,7,$A145:$G146)","v":0}]
[{"$f":"Vaktliste!$A$2","v":1},"Timer",null,{"$f":"D147*DGET(Timer,3,$B141:$B142)","v":0},{"$f":"E147*DGET(Timer,3,$B141:$B142)","v":0},{"$f":"F147*DGET(Timer,3,B141:B142)","v":0}]
["X","Satser",null,{"$f":"IF(D148>0,DGET(Vaktperiode0,D$20,$B141:$B142),0)","v":0},{"$f":"IF(E148>0,DGET(Vaktperiode0,E$20,$B141:$B142),0)","v":0},{"$f":"IF(F148>0,DGET(Vaktperiode0,F$20,$B141:$B142),0)","v":0}]
[{"$f":"Vaktliste!$A$2","v":1},"Beløp",null,{"$f":"D149*D148","v":0},{"$f":"E149*E148","v":0},{"$f":"F149*F148","v":0},null,{"$f":"SUM(D150:F150)","v":0}]
[null,"Sum antall vakter / beløp",null,{"$f":"D28+D38+D48+D58+D68+D78+D88+D98+D108+D118+D128+D138+D148","v":0},{"$f":"E28+E38+E48+E58+E68+E78+E88+E98+E108+E118+E128+E138+E148","v":0},{"$f":"F28+F38+F48+F58+F68+F78+F88+F98+F108+F118+F128+F138+F148","v":0},null,{"$f":"SUM(H27:H150)","v":0}]

{"sheet":"nn (3)","index":3,"n_rows":151,"n_cols":8,"rows_kept":151,"cut":false,"hidden":false,"merged":[[150,5,150,6],[148,1,148,2],[148,5,148,6],[149,1,149,2],[149,5,149,6],[139,1,139,2],[139,5,139,6],[146,1,146,2],[146,5,146,6],[147,1,147,2],[127,1,127,2],[127,5,127,6],[128,1,128,2],[128,5,128,6],[129,1,129,2],[129,5,129,6],[147,5,147,6],[136,1,136,2],[136,5,136,6],[137,1,137,2],[137,5,137,6],[138,1,138,2],[138,5,138,6],[11,3,11,4],[3,2,3,6],[5,2,5,6],[9,2,9,4],[7,2,7,6],[126,1,126,2],[126,5,126,6],[27,1,27,2],[27,5,27,6],[28,1,28,2],[29,1,29,2],[29,5,29,6],[36,1,36,2],[36,5,36,6],[28,5,28,6],[16,3,16,6],[17,3,17,6],[19,5,19,6],[26,1,26,2],[26,5,26,6],[47,1,47,2],[47,5,47,6],[48,1,48,2],[48,5,48,6],[39,1,39,2],[39,5,39,6],[46,1,46,2],[46,5,46,6],[37,1,37,2],[37,5,37,6],[38,1,38,2],[38,5,38,6],[59,1,59,2],[59,5,59,6],[66,1,66,2],[66,5,66,6],[57,1,57,2],[57,5,57,6],[58,1,58,2],[58,5,58,6],[49,1,49,2],[49,5,49,6],[56,1,56,2],[56,5,56,6],[77,1,77,2],[77,5,77,6],[78,1,78,2],[78,5,78,6],[69,1,69,2],[69,5,69,6],[76,1,76,2],[76,5,76,6],[67,1,67,2],[67,5,67,6],[68,1,68,2],[68,5,68,6],[89,1,89,2],[89,5,89,6],[96,1,96,2],[96,5,96,6],[87,1,87,2],[87,5,87,6],[88,1,88,2],[88,5,88,6],[79,1,79,2],[79,5,79,6],[86,1,86,2],[86,5,86,6],[12,2,12,6],[119,1,119,2],[119,5,119,6],[13,2,13,3],[117,1,117,2],[117,5,117,6],[118,1,118,2],[118,5,118,6],[109,1,109,2],[109,5,109,6],[116,1,116,2],[116,5,116,6],[107,1,107,2],[107,5,107,6],[108,1,108,2],[108,5,108,6],[99,1,99,2],[99,5,99,6],[106,1,106,2],[106,5,106,6],[97,1,97,2],[97,5,97,6],[98,1,98,2],[98,5,98,6]]}
[null,"REGNING"]
[null,"GODTGJØRING FOR DELTAKELSE I KLINISK VETERINÆRVAKT"]
[]
[null,"Navn:",null,null,null,null,null,"Fakturadato:"]
[null,null,null,null,null,null,null,"Forfallsdato:"]
[null,"Adresse:"]
[]
[null,"Postnummer, -sted:"]
[]
[null,"Bankgirokontonr:"]
[]
[null,"Organisasjonsnummer:","NO",null,null,"MVA"]
[null,"Fullt navn:"]
[null,"Initialer:","nn3"]
[null,"Regningen gjelder vakttjeneste i vaktområdet (jfr. vaktliste):"]
[null,{"$f":"Vaktliste!E1","v":"Primært vaktområde"}]
[null,"for perioden:"]
[null,{"$f":"Vaktliste!B3","v":"2026-01-01"},null,{"$f":"Vaktliste!E4","v":0}]
[]
[null,"Vakttype - antall vakter",null,"Ordinær","Sesong","Vakans",null,"Beløp"]
["X","Vaktperiode",null,"Ordinær"]
[{"$f":"Vaktliste!$A$2","v":1},"1a",null,{"$f":"$C$14","v":"nn3"}]
["X","Vaktperiode",null,null,"Sesong"]
[{"$f":"Vaktliste!$A$2","v":1},{"$f":"B22","v":"1a"},null,null,{"$f":"$C$14","v":"nn3"}]
["X","Vaktperiode",null,null,null,null,"Vakans"]
[{"$f":"Vaktliste!$A$2","v":1},{"$f":"B24","v":"1a"},null,null,null,null,{"$f":"$C$14","v":"nn3"}]
["X",{"$f":"VLOOKUP(B22,Vaktperioder,2,0)","v":"Hverdag, kveld 1600 - 2200"},null,{"$f":"DCOUNTA(Vaktliste,5,$A21:$G22)","v":0},{"$f":"DCOUNTA(Vaktliste,6,$A23:$G24)","v":0},{"$f":"DCOUNTA(Vaktliste,7,$A25:$G26)","v":0}]
[{"$f":"Vaktliste!$A$2","v":1},"Timer",null,{"$f":"D27*DGET(Timer,3,$B21:$B22)","v":0},{"$f":"E27*DGET(Timer,3,$B21:$B22)","v":0},{"$f":"F27*DGET(Timer,3,B21:B22)","v":0}]
["X","Satser",null,{"$f":"IF(D28>0,DGET(Vaktperiode0,D$20,$B21:$B22),0)","v":0},{"$f":"IF(E28>0,DGET(Vaktperiode0,E$20,$B21:$B22),0)","v":0},{"$f":"IF(F28>0,DGET(Vaktperiode0,F$20,$B21:$B22),0)","v":0}]
[{"$f":"Vaktliste!$A$2","v":1},"Beløp",null,{"$f":"D29*D28","v":0},{"$f":"E29*E28","v":0},{"$f":"F29*F28","v":0},null,{"$f":"SUM(D30:F30)","v":0}]
["X","Vaktperiode",null,"Ordinær"]
[{"$f":"Vaktliste!$A$2","v":1},"2a",null,{"$f":"$C$14","v":"nn3"}]
["X","Vaktperiode",null,null,"Sesong"]
[{"$f":"Vaktliste!$A$2","v":1},{"$f":"B32","v":"2a"},null,null,{"$f":"$C$14","v":"nn3"}]
["X","Vaktperiode",null,null,null,null,"Vakans"]
[{"$f":"Vaktliste!$A$2","v":1},{"$f":"B34","v":"2a"},null,null,null,null,{"$f":"$C$14","v":"nn3"}]
["X",{"$f":"VLOOKUP(B32,Vaktperioder,2,0)","v":"Hverdag, morgen 0600 - 0800"},null,{"$f":"DCOUNTA(Vaktliste,5,$A31:$G32)","v":0},{"$f":"DCOUNTA(Vaktliste,6,$A33:$G34)","v":0},{"$f":"DCOUNTA(Vaktliste,7,$A35:$G36)","v":0}]
[{"$f":"Vaktliste!$A$2","v":1},"Timer",null,{"$f":"D37*DGET(Timer,3,$B31:$B32)","v":0},{"$f":"E37*DGET(Timer,3,$B31:$B32)","v":0},{"$f":"F37*DGET(Timer,3,B31:B32)","v":0}]
["X","Satser",null,{"$f":"IF(D38>0,DGET(Vaktperiode0,D$20,$B31:$B32),0)","v":0},{"$f":"IF(E38>0,DGET(Vaktperiode0,E$20,$B31:$B32),0)","v":0},{"$f":"IF(F38>0,DGET(Vaktperiode0,F$20,$B31:$B32),0)","v":0}]
[{"$f":"Vaktliste!$A$2","v":1},"Beløp",null,{"$f":"D39*D38","v":0},{"$f":"E39*E38","v":0},{"$f":"F39*F38","v":0},null,{"$f":"SUM(D40:F40)","v":0}]
["X","Vaktperiode",null,"Ordinær"]
[{"$f":"Vaktliste!$A$2","v":1},"3a",null,{"$f":"$C$14","v":"nn3"}]
["X","Vaktperiode",null,null,"Sesong"]
[{"$f":"Vaktliste!$A$2","v":1},{"$f":"B42","v":"3a"},null,null,{"$f":"$C$14","v":"nn3"}]
["X","Vaktperiode",null,null,null,null,"Vakans"]
[{"$f":"Vaktliste!$A$2","v":1},{"$f":"B44","v":"3a"},null,null,null,null,{"$f":"$C$14","v":"nn3"}]
["X",{"$f":"VLOOKUP(B42,Vaktperioder,2,0)","v":"Lørdag, søndag 0600 - 2200"},null,{"$f":"DCOUNTA(Vaktliste,5,$A41:$G42)","v":0},{"$f":"DCOUNTA(Vaktliste,6,$A43:$G44)","v":0},{"$f":"DCOUNTA(Vaktliste,7,$A45:$G46)","v":0}]
[{"$f":"Vaktliste!$A$2","v":1},"Timer",null,{"$f":"D47*DGET(Timer,3,$B41:$B42)","v":0},{"$f":"E47*DGET(Timer,3,$B41:$B42)","v":0},{"$f":"F47*DGET(Timer,3,B41:B42)","v":0}]
["X","Satser",null,{"$f":"IF(D48>0,DGET(Vaktperiode0,D$20,$B41:$B42),0)","v":0},{"$f":"IF(E48>0,DGET(Vaktperiode0,E$20,$B41:$B42),0)","v":0},{"$f":"IF(F48>0,DGET(Vaktperiode0,F$20,$B41:$B42),0)","v":0}]
[{"$f":"Vaktliste!$A$2","v":1},"Beløp",null,{"$f":"D49*D48","v":0},{"$f":"E49*E48","v":0},{"$f":"F49*F48","v":0},null,{"$f":"SUM(D50:F50)","v":0}]
["X","Vaktperiode",null,"Ordinær"]
[{"$f":"Vaktliste!$A$2","v":1},"3b",null,{"$f":"$C$14","v":"nn3"}]
["X","Vaktperiode",null,null,"Sesong"]
[{"$f":"Vaktliste!$A$2","v":1},{"$f":"B52","v":"3b"},null,null,{"$f":"$C$14","v":"nn3"}]
["X","Vaktperiode",null,null,null,null,"Vakans"]
[{"$f":"Vaktliste!$A$2","v":1},{"$f":"B54","v":"3b"},null,null,null,null,{"$f":"$C$14","v":"nn3"}]
["X",{"$f":"VLOOKUP(B52,Vaktperioder,2,0)","v":"Hellig- og høytidsdag 0600 - 2200"},null,{"$f":"DCOUNTA(Vaktliste,5,$A51:$G52)","v":0},{"$f":"DCOUNTA(Vaktliste,6,$A53:$G54)","v":0},{"$f":"DCOUNTA(Vaktliste,7,$A55:$G56)","v":0}]
[{"$f":"Vaktliste!$A$2","v":1},"Timer",null,{"$f":"D57*DGET(Timer,3,$B51:$B52)","v":0},{"$f":"E57*DGET(Timer,3,$B51:$B52)","v":0},{"$f":"F57*DGET(Timer,3,B51:B52)","v":0}]
["X","Satser",null,{"$f":"IF(D58>0,DGET(Vaktperiode0,D$20,$B51:$B52),0)","v":0},{"$f":"IF(E58>0,DGET(Vaktperiode0,E$20,$B51:$B52),0)","v":0},{"$f":"IF(F58>0,DGET(Vaktperiode0,F$20,$B51:$B52),0)","v":0}]
[{"$f":"Vaktliste!$A$2","v":1},"Beløp",null,{"$f":"D59*D58","v":0},{"$f":"E59*E58","v":0},{"$f":"F59*F58","v":0},null,{"$f":"SUM(D60:F60)","v":0}]
["X","Vaktperiode",null,"Ordinær"]
[{"$f":"Vaktliste!$A$2","v":1},"3c",null,{"$f":"$C$14","v":"nn3"}]
["X","Vaktperiode",null,null,"Sesong"]
[{"$f":"Vaktliste!$A$2","v":1},{"$f":"B62","v":"3c"},null,null,{"$f":"$C$14","v":"nn3"}]
["X","Vaktperiode",null,null,null,null,"Vakans"]
[{"$f":"Vaktliste!$A$2","v":1},{"$f":"B64","v":"3c"},null,null,null,null,{"$f":"$C$14","v":"nn3"}]
["X",{"$f":"VLOOKUP(B62,Vaktperioder,2,0)","v":"Jul- og nyttårsaften 0600 - 1200"},null,{"$f":"DCOUNTA(Vaktliste,5,$A61:$G62)","v":0},{"$f":"DCOUNTA(Vaktliste,6,$A63:$G64)","v":0},{"$f":"DCOUNTA(Vaktliste,7,$A65:$G66)","v":0}]
[{"$f":"Vaktliste!$A$2","v":1},"Timer",null,{"$f":"D67*DGET(Timer,3,$B61:$B62)","v":0},{"$f":"E67*DGET(Timer,3,$B61:$B62)","v":0},{"$f":"F67*DGET(Timer,3,B61:B62)","v":0}]
["X","Satser",null,{"$f":"IF(D68>0,DGET(Vaktperiode0,D$20,$B61:$B62),0)","v":0},{"$f":"IF(E68>0,DGET(Vaktperiode0,E$20,$B61:$B62),0)","v":0},{"$f":"IF(F68>0,DGET(Vaktperiode0,F$20,$B61:$B62),0)","v":0}]
[{"$f":"Vaktliste!$A$2","v":1},"Beløp",null,{"$f":"D69*D68","v":0},{"$f":"E69*E68","v":0},{"$f":"F69*F68","v":0},null,{"$f":"SUM(D70:F70)","v":0}]
["X","Vaktperiode",null,"Ordinær"]
[{"$f":"Vaktliste!$A$2","v":1},"3d",null,{"$f":"$C$14","v":"nn3"}]
["X","Vaktperiode",null,null,"Sesong"]
[{"$f":"Vaktliste!$A$2","v":1},{"$f":"B72","v":"3d"},null,null,{"$f":"$C$14","v":"nn3"}]
["X","Vaktperiode",null,null,null,null,"Vakans"]
[{"$f":"Vaktliste!$A$2","v":1},{"$f":"B74","v":"3d"},null,null,null,null,{"$f":"$C$14","v":"nn3"}]
["X",{"$f":"VLOOKUP(B72,Vaktperioder,2,0)","v":"Påske-, jul- og nyttårsaften 1200 - 2200"},null,{"$f":"DCOUNTA(Vaktliste,5,$A71:$G72)","v":0},{"$f":"DCOUNTA(Vaktliste,6,$A73:$G74)","v":0},{"$f":"DCOUNTA(Vaktliste,7,$A75:$G76)","v":0}]
[{"$f":"Vaktliste!$A$2","v":1},"Timer",null,{"$f":"D77*DGET(Timer,3,$B71:$B72)","v":0},{"$f":"E77*DGET(Timer,3,$B71:$B72)","v":0},{"$f":"F77*DGET(Timer,3,B71:B72)","v":0}]
["X","Satser",null,{"$f":"IF(D78>0,DGET(Vaktperiode0,D$20,$B71:$B72),0)","v":0},{"$f":"IF(E78>0,DGET(Vaktperiode0,E$20,$B71:$B72),0)","v":0},{"$f":"IF(F78>0,DGET(Vaktperiode0,F$20,$B71:$B72),0)","v":0}]
[{"$f":"Vaktliste!$A$2","v":1},"Beløp",null,{"$f":"D79*D78","v":0},{"$f":"E79*E78","v":0},{"$f":"F79*F78","v":0},null,{"$f":"SUM(D80:F80)","v":0}]
["X","Vaktperiode",null,"Ordinær"]
[{"$f":"Vaktliste!$A$2","v":1},"3e",null,{"$f":"$C$14","v":"nn3"}]
["X","Vaktperiode",null,null,"Sesong"]
[{"$f":"Vaktliste!$A$2","v":1},{"$f":"B82","v":"3e"},null,null,{"$f":"$C$14","v":"nn3"}]
["X","Vaktperiode",null,null,null,null,"Vakans"]
[{"$f":"Vaktliste!$A$2","v":1},{"$f":"B84","v":"3e"},null,null,null,null,{"$f":"$C$14","v":"nn3"}]
["X",{"$f":"VLOOKUP(B82,Vaktperioder,2,0)","v":"Påskeaften 0600 - 1200"},null,{"$f":"DCOUNTA(Vaktliste,5,$A81:$G82)","v":0},{"$f":"DCOUNTA(Vaktliste,6,$A83:$G84)","v":0},{"$f":"DCOUNTA(Vaktliste,7,$A85:$G86)","v":0}]
[{"$f":"Vaktliste!$A$2","v":1},"Timer",null,{"$f":"D87*DGET(Timer,3,$B81:$B82)","v":0},{"$f":"E87*DGET(Timer,3,$B81:$B82)","v":0},{"$f":"F87*DGET(Timer,3,B81:B82)","v":0}]
["X","Satser",null,{"$f":"IF(D88>0,DGET(Vaktperiode0,D$20,$B81:$B82),0)","v":0},{"$f":"IF(E88>0,DGET(Vaktperiode0,E$20,$B81:$B82),0)","v":0},{"$f":"IF(F88>0,DGET(Vaktperiode0,F$20,$B81:$B82),0)","v":0}]
[{"$f":"Vaktliste!$A$2","v":1},"Beløp",null,{"$f":"D89*D88","v":0},{"$f":"E89*E88","v":0},{"$f":"F89*F88","v":0},null,{"$f":"SUM(D90:F90)","v":0}]
["X","Vaktperiode",null,"Ordinær"]
[{"$f":"Vaktliste!$A$2","v":1},"4a",null,{"$f":"$C$14","v":"nn3"}]
["X","Vaktperiode",null,null,"Sesong"]
[{"$f":"Vaktliste!$A$2","v":1},{"$f":"B92","v":"4a"},null,null,{"$f":"$C$14","v":"nn3"}]
["X","Vaktperiode",null,null,null,null,"Vakans"]
[{"$f":"Vaktliste!$A$2","v":1},{"$f":"B94","v":"4a"},null,null,null,null,{"$f":"$C$14","v":"nn3"}]
["X",{"$f":"VLOOKUP(B92,Vaktperioder,2,0)","v":"Natt hverdag 2200 - 2400"},null,{"$f":"DCOUNTA(Vaktliste,5,$A91:$G92)","v":0},{"$f":"DCOUNTA(Vaktliste,6,$A93:$G94)","v":0},{"$f":"DCOUNTA(Vaktliste,7,$A95:$G96)","v":0}]
[{"$f":"Vaktliste!$A$2","v":1},"Timer",null,{"$f":"D97*DGET(Timer,3,$B91:$B92)","v":0},{"$f":"E97*DGET(Timer,3,$B91:$B92)","v":0},{"$f":"F97*DGET(Timer,3,B91:B92)","v":0}]
["X","Satser",null,{"$f":"IF(D98>0,DGET(Vaktperiode0,D$20,$B91:$B92),0)","v":0},{"$f":"IF(E98>0,DGET(Vaktperiode0,E$20,$B91:$B92),0)","v":0},{"$f":"IF(F98>0,DGET(Vaktperiode0,F$20,$B91:$B92),0)","v":0}]
[{"$f":"Vaktliste!$A$2","v":1},"Beløp",null,{"$f":"D99*D98","v":0},{"$f":"E99*E98","v":0},{"$f":"F99*F98","v":0},null,{"$f":"SUM(D100:F100)","v":0}]
["X","Vaktperiode",null,"Ordinær"]
[{"$f":"Vaktliste!$A$2","v":1},"4b",null,{"$f":"$C$14","v":"nn3"}]
["X","Vaktperiode",null,null,"Sesong"]
[{"$f":"Vaktliste!$A$2","v":1},{"$f":"B102","v":"4b"},null,null,{"$f":"$C$14","v":"nn3"}]
["X","Vaktperiode",null,null,null,null,"Vakans"]
[{"$f":"Vaktliste!$A$2","v":1},{"$f":"B104","v":"4b"},null,null,null,null,{"$f":"$C$14","v":"nn3"}]
["X",{"$f":"VLOOKUP(B102,Vaktperioder,2,0)","v":"Natt hverdag 0000 - 0600"},null,{"$f":"DCOUNTA(Vaktliste,5,$A101:$G102)","v":0},{"$f":"DCOUNTA(Vaktliste,6,$A103:$G104)","v":0},{"$f":"DCOUNTA(Vaktliste,7,$A105:$G106)","v":0}]
[{"$f":"Vaktliste!$A$2","v":1},"Timer",null,{"$f":"D107*DGET(Timer,3,$B101:$B102)","v":0},{"$f":"E107*DGET(Timer,3,$B101:$B102)","v":0},{"$f":"F107*DGET(Timer,3,B101:B102)","v":0}]
["X","Satser",null,{"$f":"IF(D108>0,DGET(Vaktperiode0,D$20,$B101:$B102),0)","v":0},{"$f":"IF(E108>0,DGET(Vaktperiode0,E$20,$B101:$B102),0)","v":0},{"$f":"IF(F108>0,DGET(Vaktperiode0,F$20,$B101:$B102),0)","v":0}]
[{"$f":"Vaktliste!$A$2","v":1},"Beløp",null,{"$f":"D109*D108","v":0},{"$f":"E109*E108","v":0},{"$f":"F109*F108","v":0},null,{"$f":"SUM(D110:F110)","v":0}]
["X","Vaktperiode",null,"Ordinær"]
[{"$f":"Vaktliste!$A$2","v":1},"4c",null,{"$f":"$C$14","v":"nn3"}]
["X","Vaktperiode",null,null,"Sesong"]
[{"$f":"Vaktliste!$A$2","v":1},{"$f":"B112","v":"4c"},null,null,{"$f":"$C$14","v":"nn3"}]
["X","Vaktperiode",null,null,null,null,"Vakans"]
[{"$f":"Vaktliste!$A$2","v":1},{"$f":"B114","v":"4c"},null,null,null,null,{"$f":"$C$14","v":"nn3"}]
["X",{"$f":"VLOOKUP(B112,Vaktperioder,2,0)","v":"Natt lørdag, søndag 2200 - 2400"},null,{"$f":"DCOUNTA(Vaktliste,5,$A111:$G112)","v":0},{"$f":"DCOUNTA(Vaktliste,6,$A113:$G114)","v":0},{"$f":"DCOUNTA(Vaktliste,7,$A115:$G116)","v":0}]
[{"$f":"Vaktliste!$A$2","v":1},"Timer",null,{"$f":"D117*DGET(Timer,3,$B111:$B112)","v":0},{"$f":"E117*DGET(Timer,3,$B111:$B112)","v":0},{"$f":"F117*DGET(Timer,3,B111:B112)","v":0}]
["X","Satser",null,{"$f":"IF(D118>0,DGET(Vaktperiode0,D$20,$B111:$B112),0)","v":0},{"$f":"IF(E118>0,DGET(Vaktperiode0,E$20,$B111:$B112),0)","v":0},{"$f":"IF(F118>0,DGET(Vaktperiode0,F$20,$B111:$B112),0)","v":0}]
[{"$f":"Vaktliste!$A$2","v":1},"Beløp",null,{"$f":"D119*D118","v":0},{"$f":"E119*E118","v":0},{"$f":"F119*F118","v":0},null,{"$f":"SUM(D120:F120)","v":0}]
["X","Vaktperiode",null,"Ordinær"]
[{"$f":"Vaktliste!$A$2","v":1},"4d",null,{"$f":"$C$14","v":"nn3"}]
["X","Vaktperiode",null,null,"Sesong"]
[{"$f":"Vaktliste!$A$2","v":1},{"$f":"B122","v":"4d"},null,null,{"$f":"$C$14","v":"nn3"}]
["X","Vaktperiode",null,null,null,null,"Vakans"]
[{"$f":"Vaktliste!$A$2","v":1},{"$f":"B124","v":"4d"},null,null,null,null,{"$f":"$C$14","v":"nn3"}]
["X",{"$f":"VLOOKUP(B122,Vaktperioder,2,0)","v":"Natt lørdag, søndag 0000 - 0600"},null,{"$f":"DCOUNTA(Vaktliste,5,$A121:$G122)","v":0},{"$f":"DCOUNTA(Vaktliste,6,$A123:$G124)","v":0},{"$f":"DCOUNTA(Vaktliste,7,$A125:$G126)","v":0}]
[{"$f":"Vaktliste!$A$2","v":1},"Timer",null,{"$f":"D127*DGET(Timer,3,$B121:$B122)","v":0},{"$f":"E127*DGET(Timer,3,$B121:$B122)","v":0},{"$f":"F127*DGET(Timer,3,B121:B122)","v":0}]
["X","Satser",null,{"$f":"IF(D128>0,DGET(Vaktperiode0,D$20,$B121:$B122),0)","v":0},{"$f":"IF(E128>0,DGET(Vaktperiode0,E$20,$B121:$B122),0)","v":0},{"$f":"IF(F128>0,DGET(Vaktperiode0,F$20,$B121:$B122),0)","v":0}]
[{"$f":"Vaktliste!$A$2","v":1},"Beløp",null,{"$f":"D129*D128","v":0},{"$f":"E129*E128","v":0},{"$f":"F129*F128","v":0},null,{"$f":"SUM(D130:F130)","v":0}]
["X","Vaktperiode",null,"Ordinær"]
[{"$f":"Vaktliste!$A$2","v":1},"4e",null,{"$f":"$C$14","v":"nn3"}]
["X","Vaktperiode",null,null,"Sesong"]
[{"$f":"Vaktliste!$A$2","v":1},{"$f":"B132","v":"4e"},null,null,{"$f":"$C$14","v":"nn3"}]
["X","Vaktperiode",null,null,null,null,"Vakans"]
[{"$f":"Vaktliste!$A$2","v":1},{"$f":"B134","v":"4e"},null,null,null,null,{"$f":"$C$14","v":"nn3"}]
["X",{"$f":"VLOOKUP(B132,Vaktperioder,2,0)","v":"Natt hellig- og høytidsdag 2200 - 2400"},null,{"$f":"DCOUNTA(Vaktliste,5,$A131:$G132)","v":0},{"$f":"DCOUNTA(Vaktliste,6,$A133:$G134)","v":0},{"$f":"DCOUNTA(Vaktliste,7,$A135:$G136)","v":0}]
[{"$f":"Vaktliste!$A$2","v":1},"Timer",null,{"$f":"D137*DGET(Timer,3,$B131:$B132)","v":0},{"$f":"E137*DGET(Timer,3,$B131:$B132)","v":0},{"$f":"F137*DGET(Timer,3,B131:B132)","v":0}]
["X","Satser",null,{"$f":"IF(D138>0,DGET(Vaktperiode0,D$20,$B131:$B132),0)","v":0},{"$f":"IF(E138>0,DGET(Vaktperiode0,E$20,$B131:$B132),0)","v":0},{"$f":"IF(F138>0,DGET(Vaktperiode0,F$20,$B131:$B132),0)","v":0}]
[{"$f":"Vaktliste!$A$2","v":1},"Beløp",null,{"$f":"D139*D138","v":0},{"$f":"E139*E138","v":0},{"$f":"F139*F138","v":0},null,{"$f":"SUM(D140:F140)","v":0}]
["X","Vaktperiode",null,"Ordinær"]
[{"$f":"Vaktliste!$A$2","v":1},"4f",null,{"$f":"$C$14","v":"nn3"}]
["X","Vaktperiode",null,null,"Sesong"]
[{"$f":"Vaktliste!$A$2","v":1},{"$f":"B142","v":"4f"},null,null,{"$f":"$C$14","v":"nn3"}]
["X","Vaktperiode",null,null,null,null,"Vakans"]
[{"$f":"Vaktliste!$A$2","v":1},{"$f":"B144","v":"4f"},null,null,null,null,{"$f":"$C$14","v":"nn3"}]
["X",{"$f":"VLOOKUP(B142,Vaktperioder,2,0)","v":"Natt hellig- og høytidsdag 0000 - 0600"},null,{"$f":"DCOUNTA(Vaktliste,5,$A141:$G142)","v":0},{"$f":"DCOUNTA(Vaktliste,6,$A143:$G144)","v":0},{"$f":"DCOUNTA(Vaktliste,7,$A145:$G146)","v":0}]
[{"$f":"Vaktliste!$A$2","v":1},"Timer",null,{"$f":"D147*DGET(Timer,3,$B141:$B142)","v":0},{"$f":"E147*DGET(Timer,3,$B141:$B142)","v":0},{"$f":"F147*DGET(Timer,3,B141:B142)","v":0}]
["X","Satser",null,{"$f":"IF(D148>0,DGET(Vaktperiode0,D$20,$B141:$B142),0)","v":0},{"$f":"IF(E148>0,DGET(Vaktperiode0,E$20,$B141:$B142),0)","v":0},{"$f":"IF(F148>0,DGET(Vaktperiode0,F$20,$B141:$B142),0)","v":0}]
[{"$f":"Vaktliste!$A$2","v":1},"Beløp",null,{"$f":"D149*D148","v":0},{"$f":"E149*E148","v":0},{"$f":"F149*F148","v":0},null,{"$f":"SUM(D150:F150)","v":0}]
[null,"Sum antall vakter / beløp",null,{"$f":"D28+D38+D48+D58+D68+D78+D88+D98+D108+D118+D128+D138+D148","v":0},{"$f":"E28+E38+E48+E58+E68+E78+E88+E98+E108+E118+E128+E138+E148","v":0},{"$f":"F28+F38+F48+F58+F68+F78+F88+F98+F108+F118+F128+F138+F148","v":0},null,{"$f":"SUM(H27:H150)","v":0}]

{"sheet":"nn (4)","index":4,"n_rows":151,"n_cols":8,"rows_kept":151,"cut":false,"hidden":false,"merged":[[150,5,150,6],[148,1,148,2],[148,5,148,6],[149,1,149,2],[149,5,149,6],[139,1,139,2],[139,5,139,6],[146,1,146,2],[146,5,146,6],[147,1,147,2],[127,1,127,2],[127,5,127,6],[128,1,128,2],[128,5,128,6],[129,1,129,2],[129,5,129,6],[147,5,147,6],[136,1,136,2],[136,5,136,6],[137,1,137,2],[137,5,137,6],[138,1,138,2],[138,5,138,6],[11,3,11,4],[3,2,3,6],[5,2,5,6],[9,2,9,4],[7,2,7,6],[126,1,126,2],[126,5,126,6],[27,1,27,2],[27,5,27,6],[28,1,28,2],[29,1,29,2],[29,5,29,6],[36,1,36,2],[36,5,36,6],[28,5,28,6],[16,3,16,6],[17,3,17,6],[19,5,19,6],[26,1,26,2],[26,5,26,6],[47,1,47,2],[47,5,47,6],[48,1,48,2],[48,5,48,6],[39,1,39,2],[39,5,39,6],[46,1,46,2],[46,5,46,6],[37,1,37,2],[37,5,37,6],[38,1,38,2],[38,5,38,6],[59,1,59,2],[59,5,59,6],[66,1,66,2],[66,5,66,6],[57,1,57,2],[57,5,57,6],[58,1,58,2],[58,5,58,6],[49,1,49,2],[49,5,49,6],[56,1,56,2],[56,5,56,6],[77,1,77,2],[77,5,77,6],[78,1,78,2],[78,5,78,6],[69,1,69,2],[69,5,69,6],[76,1,76,2],[76,5,76,6],[67,1,67,2],[67,5,67,6],[68,1,68,2],[68,5,68,6],[89,1,89,2],[89,5,89,6],[96,1,96,2],[96,5,96,6],[87,1,87,2],[87,5,87,6],[88,1,88,2],[88,5,88,6],[79,1,79,2],[79,5,79,6],[86,1,86,2],[86,5,86,6],[12,2,12,6],[119,1,119,2],[119,5,119,6],[13,2,13,3],[117,1,117,2],[117,5,117,6],[118,1,118,2],[118,5,118,6],[109,1,109,2],[109,5,109,6],[116,1,116,2],[116,5,116,6],[107,1,107,2],[107,5,107,6],[108,1,108,2],[108,5,108,6],[99,1,99,2],[99,5,99,6],[106,1,106,2],[106,5,106,6],[97,1,97,2],[97,5,97,6],[98,1,98,2],[98,5,98,6]]}
[null,"REGNING"]
[null,"GODTGJØRING FOR DELTAKELSE I KLINISK VETERINÆRVAKT"]
[]
[null,"Navn:",null,null,null,null,null,"Fakturadato:"]
[null,null,null,null,null,null,null,"Forfallsdato:"]
[null,"Adresse:"]
[]
[null,"Postnummer, -sted:"]
[]
[null,"Bankgirokontonr:"]
[]
[null,"Organisasjonsnummer:","NO",null,null,"MVA"]
[null,"Fullt navn:"]
[null,"Initialer:","nn4"]
[null,"Regningen gjelder vakttjeneste i vaktområdet (jfr. vaktliste):"]
[null,{"$f":"Vaktliste!E1","v":"Primært vaktområde"}]
[null,"for perioden:"]
[null,{"$f":"Vaktliste!B3","v":"2026-01-01"},null,{"$f":"Vaktliste!E4","v":0}]
[]
[null,"Vakttype - antall vakter",null,"Ordinær","Sesong","Vakans",null,"Beløp"]
["X","Vaktperiode",null,"Ordinær"]
[{"$f":"Vaktliste!$A$2","v":1},"1a",null,{"$f":"$C$14","v":"nn4"}]
["X","Vaktperiode",null,null,"Sesong"]
[{"$f":"Vaktliste!$A$2","v":1},{"$f":"B22","v":"1a"},null,null,{"$f":"$C$14","v":"nn4"}]
["X","Vaktperiode",null,null,null,null,"Vakans"]
[{"$f":"Vaktliste!$A$2","v":1},{"$f":"B24","v":"1a"},null,null,null,null,{"$f":"$C$14","v":"nn4"}]
["X",{"$f":"VLOOKUP(B22,Vaktperioder,2,0)","v":"Hverdag, kveld 1600 - 2200"},null,{"$f":"DCOUNTA(Vaktliste,5,$A21:$G22)","v":0},{"$f":"DCOUNTA(Vaktliste,6,$A23:$G24)","v":0},{"$f":"DCOUNTA(Vaktliste,7,$A25:$G26)","v":0}]
[{"$f":"Vaktliste!$A$2","v":1},"Timer",null,{"$f":"D27*DGET(Timer,3,$B21:$B22)","v":0},{"$f":"E27*DGET(Timer,3,$B21:$B22)","v":0},{"$f":"F27*DGET(Timer,3,B21:B22)","v":0}]
["X","Satser",null,{"$f":"IF(D28>0,DGET(Vaktperiode0,D$20,$B21:$B22),0)","v":0},{"$f":"IF(E28>0,DGET(Vaktperiode0,E$20,$B21:$B22),0)","v":0},{"$f":"IF(F28>0,DGET(Vaktperiode0,F$20,$B21:$B22),0)","v":0}]
[{"$f":"Vaktliste!$A$2","v":1},"Beløp",null,{"$f":"D29*D28","v":0},{"$f":"E29*E28","v":0},{"$f":"F29*F28","v":0},null,{"$f":"SUM(D30:F30)","v":0}]
["X","Vaktperiode",null,"Ordinær"]
[{"$f":"Vaktliste!$A$2","v":1},"2a",null,{"$f":"$C$14","v":"nn4"}]
["X","Vaktperiode",null,null,"Sesong"]
[{"$f":"Vaktliste!$A$2","v":1},{"$f":"B32","v":"2a"},null,null,{"$f":"$C$14","v":"nn4"}]
["X","Vaktperiode",null,null,null,null,"Vakans"]
[{"$f":"Vaktliste!$A$2","v":1},{"$f":"B34","v":"2a"},null,null,null,null,{"$f":"$C$14","v":"nn4"}]
["X",{"$f":"VLOOKUP(B32,Vaktperioder,2,0)","v":"Hverdag, morgen 0600 - 0800"},null,{"$f":"DCOUNTA(Vaktliste,5,$A31:$G32)","v":0},{"$f":"DCOUNTA(Vaktliste,6,$A33:$G34)","v":0},{"$f":"DCOUNTA(Vaktliste,7,$A35:$G36)","v":0}]
[{"$f":"Vaktliste!$A$2","v":1},"Timer",null,{"$f":"D37*DGET(Timer,3,$B31:$B32)","v":0},{"$f":"E37*DGET(Timer,3,$B31:$B32)","v":0},{"$f":"F37*DGET(Timer,3,B31:B32)","v":0}]
["X","Satser",null,{"$f":"IF(D38>0,DGET(Vaktperiode0,D$20,$B31:$B32),0)","v":0},{"$f":"IF(E38>0,DGET(Vaktperiode0,E$20,$B31:$B32),0)","v":0},{"$f":"IF(F38>0,DGET(Vaktperiode0,F$20,$B31:$B32),0)","v":0}]
[{"$f":"Vaktliste!$A$2","v":1},"Beløp",null,{"$f":"D39*D38","v":0},{"$f":"E39*E38","v":0},{"$f":"F39*F38","v":0},null,{"$f":"SUM(D40:F40)","v":0}]
["X","Vaktperiode",null,"Ordinær"]
[{"$f":"Vaktliste!$A$2","v":1},"3a",null,{"$f":"$C$14","v":"nn4"}]
["X","Vaktperiode",null,null,"Sesong"]
[{"$f":"Vaktliste!$A$2","v":1},{"$f":"B42","v":"3a"},null,null,{"$f":"$C$14","v":"nn4"}]
["X","Vaktperiode",null,null,null,null,"Vakans"]
[{"$f":"Vaktliste!$A$2","v":1},{"$f":"B44","v":"3a"},null,null,null,null,{"$f":"$C$14","v":"nn4"}]
["X",{"$f":"VLOOKUP(B42,Vaktperioder,2,0)","v":"Lørdag, søndag 0600 - 2200"},null,{"$f":"DCOUNTA(Vaktliste,5,$A41:$G42)","v":0},{"$f":"DCOUNTA(Vaktliste,6,$A43:$G44)","v":0},{"$f":"DCOUNTA(Vaktliste,7,$A45:$G46)","v":0}]
[{"$f":"Vaktliste!$A$2","v":1},"Timer",null,{"$f":"D47*DGET(Timer,3,$B41:$B42)","v":0},{"$f":"E47*DGET(Timer,3,$B41:$B42)","v":0},{"$f":"F47*DGET(Timer,3,B41:B42)","v":0}]
["X","Satser",null,{"$f":"IF(D48>0,DGET(Vaktperiode0,D$20,$B41:$B42),0)","v":0},{"$f":"IF(E48>0,DGET(Vaktperiode0,E$20,$B41:$B42),0)","v":0},{"$f":"IF(F48>0,DGET(Vaktperiode0,F$20,$B41:$B42),0)","v":0}]
[{"$f":"Vaktliste!$A$2","v":1},"Beløp",null,{"$f":"D49*D48","v":0},{"$f":"E49*E48","v":0},{"$f":"F49*F48","v":0},null,{"$f":"SUM(D50:F50)","v":0}]
["X","Vaktperiode",null,"Ordinær"]
[{"$f":"Vaktliste!$A$2","v":1},"3b",null,{"$f":"$C$14","v":"nn4"}]
["X","Vaktperiode",null,null,"Sesong"]
[{"$f":"Vaktliste!$A$2","v":1},{"$f":"B52","v":"3b"},null,null,{"$f":"$C$14","v":"nn4"}]
["X","Vaktperiode",null,null,null,null,"Vakans"]
[{"$f":"Vaktliste!$A$2","v":1},{"$f":"B54","v":"3b"},null,null,null,null,{"$f":"$C$14","v":"nn4"}]
["X",{"$f":"VLOOKUP(B52,Vaktperioder,2,0)","v":"Hellig- og høytidsdag 0600 - 2200"},null,{"$f":"DCOUNTA(Vaktliste,5,$A51:$G52)","v":0},{"$f":"DCOUNTA(Vaktliste,6,$A53:$G54)","v":0},{"$f":"DCOUNTA(Vaktliste,7,$A55:$G56)","v":0}]
[{"$f":"Vaktliste!$A$2","v":1},"Timer",null,{"$f":"D57*DGET(Timer,3,$B51:$B52)","v":0},{"$f":"E57*DGET(Timer,3,$B51:$B52)","v":0},{"$f":"F57*DGET(Timer,3,B51:B52)","v":0}]
["X","Satser",null,{"$f":"IF(D58>0,DGET(Vaktperiode0,D$20,$B51:$B52),0)","v":0},{"$f":"IF(E58>0,DGET(Vaktperiode0,E$20,$B51:$B52),0)","v":0},{"$f":"IF(F58>0,DGET(Vaktperiode0,F$20,$B51:$B52),0)","v":0}]
[{"$f":"Vaktliste!$A$2","v":1},"Beløp",null,{"$f":"D59*D58","v":0},{"$f":"E59*E58","v":0},{"$f":"F59*F58","v":0},null,{"$f":"SUM(D60:F60)","v":0}]
["X","Vaktperiode",null,"Ordinær"]
[{"$f":"Vaktliste!$A$2","v":1},"3c",null,{"$f":"$C$14","v":"nn4"}]
["X","Vaktperiode",null,null,"Sesong"]
[{"$f":"Vaktliste!$A$2","v":1},{"$f":"B62","v":"3c"},null,null,{"$f":"$C$14","v":"nn4"}]
["X","Vaktperiode",null,null,null,null,"Vakans"]
[{"$f":"Vaktliste!$A$2","v":1},{"$f":"B64","v":"3c"},null,null,null,null,{"$f":"$C$14","v":"nn4"}]
["X",{"$f":"VLOOKUP(B62,Vaktperioder,2,0)","v":"Jul- og nyttårsaften 0600 - 1200"},null,{"$f":"DCOUNTA(Vaktliste,5,$A61:$G62)","v":0},{"$f":"DCOUNTA(Vaktliste,6,$A63:$G64)","v":0},{"$f":"DCOUNTA(Vaktliste,7,$A65:$G66)","v":0}]
[{"$f":"Vaktliste!$A$2","v":1},"Timer",null,{"$f":"D67*DGET(Timer,3,$B61:$B62)","v":0},{"$f":"E67*DGET(Timer,3,$B61:$B62)","v":0},{"$f":"F67*DGET(Timer,3,B61:B62)","v":0}]
["X","Satser",null,{"$f":"IF(D68>0,DGET(Vaktperiode0,D$20,$B61:$B62),0)","v":0},{"$f":"IF(E68>0,DGET(Vaktperiode0,E$20,$B61:$B62),0)","v":0},{"$f":"IF(F68>0,DGET(Vaktperiode0,F$20,$B61:$B62),0)","v":0}]
[{"$f":"Vaktliste!$A$2","v":1},"Beløp",null,{"$f":"D69*D68","v":0},{"$f":"E69*E68","v":0},{"$f":"F69*F68","v":0},null,{"$f":"SUM(D70:F70)","v":0}]
["X","Vaktperiode",null,"Ordinær"]
[{"$f":"Vaktliste!$A$2","v":1},"3d",null,{"$f":"$C$14","v":"nn4"}]
["X","Vaktperiode",null,null,"Sesong"]
[{"$f":"Vaktliste!$A$2","v":1},{"$f":"B72","v":"3d"},null,null,{"$f":"$C$14","v":"nn4"}]
["X","Vaktperiode",null,null,null,null,"Vakans"]
[{"$f":"Vaktliste!$A$2","v":1},{"$f":"B74","v":"3d"},null,null,null,null,{"$f":"$C$14","v":"nn4"}]
["X",{"$f":"VLOOKUP(B72,Vaktperioder,2,0)","v":"Påske-, jul- og nyttårsaften 1200 - 2200"},null,{"$f":"DCOUNTA(Vaktliste,5,$A71:$G72)","v":0},{"$f":"DCOUNTA(Vaktliste,6,$A73:$G74)","v":0},{"$f":"DCOUNTA(Vaktliste,7,$A75:$G76)","v":0}]
[{"$f":"Vaktliste!$A$2","v":1},"Timer",null,{"$f":"D77*DGET(Timer,3,$B71:$B72)","v":0},{"$f":"E77*DGET(Timer,3,$B71:$B72)","v":0},{"$f":"F77*DGET(Timer,3,B71:B72)","v":0}]
["X","Satser",null,{"$f":"IF(D78>0,DGET(Vaktperiode0,D$20,$B71:$B72),0)","v":0},{"$f":"IF(E78>0,DGET(Vaktperiode0,E$20,$B71:$B72),0)","v":0},{"$f":"IF(F78>0,DGET(Vaktperiode0,F$20,$B71:$B72),0)","v":0}]
[{"$f":"Vaktliste!$A$2","v":1},"Beløp",null,{"$f":"D79*D78","v":0},{"$f":"E79*E78","v":0},{"$f":"F79*F78","v":0},null,{"$f":"SUM(D80:F80)","v":0}]
["X","Vaktperiode",null,"Ordinær"]
[{"$f":"Vaktliste!$A$2","v":1},"3e",null,{"$f":"$C$14","v":"nn4"}]
["X","Vaktperiode",null,null,"Sesong"]
[{"$f":"Vaktliste!$A$2","v":1},{"$f":"B82","v":"3e"},null,null,{"$f":"$C$14","v":"nn4"}]
["X","Vaktperiode",null,null,null,null,"Vakans"]
[{"$f":"Vaktliste!$A$2","v":1},{"$f":"B84","v":"3e"},null,null,null,null,{"$f":"$C$14","v":"nn4"}]
["X",{"$f":"VLOOKUP(B82,Vaktperioder,2,0)","v":"Påskeaften 0600 - 1200"},null,{"$f":"DCOUNTA(Vaktliste,5,$A81:$G82)","v":0},{"$f":"DCOUNTA(Vaktliste,6,$A83:$G84)","v":0},{"$f":"DCOUNTA(Vaktliste,7,$A85:$G86)","v":0}]
[{"$f":"Vaktliste!$A$2","v":1},"Timer",null,{"$f":"D87*DGET(Timer,3,$B81:$B82)","v":0},{"$f":"E87*DGET(Timer,3,$B81:$B82)","v":0},{"$f":"F87*DGET(Timer,3,B81:B82)","v":0}]
["X","Satser",null,{"$f":"IF(D88>0,DGET(Vaktperiode0,D$20,$B81:$B82),0)","v":0},{"$f":"IF(E88>0,DGET(Vaktperiode0,E$20,$B81:$B82),0)","v":0},{"$f":"IF(F88>0,DGET(Vaktperiode0,F$20,$B81:$B82),0)","v":0}]
[{"$f":"Vaktliste!$A$2","v":1},"Beløp",null,{"$f":"D89*D88","v":0},{"$f":"E89*E88","v":0},{"$f":"F89*F88","v":0},null,{"$f":"SUM(D90:F90)","v":0}]
["X","Vaktperiode",null,"Ordinær"]
[{"$f":"Vaktliste!$A$2","v":1},"4a",null,{"$f":"$C$14","v":"nn4"}]
["X","Vaktperiode",null,null,"Sesong"]
[{"$f":"Vaktliste!$A$2","v":1},{"$f":"B92","v":"4a"},null,null,{"$f":"$C$14","v":"nn4"}]
["X","Vaktperiode",null,null,null,null,"Vakans"]
[{"$f":"Vaktliste!$A$2","v":1},{"$f":"B94","v":"4a"},null,null,null,null,{"$f":"$C$14","v":"nn4"}]
["X",{"$f":"VLOOKUP(B92,Vaktperioder,2,0)","v":"Natt hverdag 2200 - 2400"},null,{"$f":"DCOUNTA(Vaktliste,5,$A91:$G92)","v":0},{"$f":"DCOUNTA(Vaktliste,6,$A93:$G94)","v":0},{"$f":"DCOUNTA(Vaktliste,7,$A95:$G96)","v":0}]
[{"$f":"Vaktliste!$A$2","v":1},"Timer",null,{"$f":"D97*DGET(Timer,3,$B91:$B92)","v":0},{"$f":"E97*DGET(Timer,3,$B91:$B92)","v":0},{"$f":"F97*DGET(Timer,3,B91:B92)","v":0}]
["X","Satser",null,{"$f":"IF(D98>0,DGET(Vaktperiode0,D$20,$B91:$B92),0)","v":0},{"$f":"IF(E98>0,DGET(Vaktperiode0,E$20,$B91:$B92),0)","v":0},{"$f":"IF(F98>0,DGET(Vaktperiode0,F$20,$B91:$B92),0)","v":0}]
[{"$f":"Vaktliste!$A$2","v":1},"Beløp",null,{"$f":"D99*D98","v":0},{"$f":"E99*E98","v":0},{"$f":"F99*F98","v":0},null,{"$f":"SUM(D100:F100)","v":0}]
["X","Vaktperiode",null,"Ordinær"]
[{"$f":"Vaktliste!$A$2","v":1},"4b",null,{"$f":"$C$14","v":"nn4"}]
["X","Vaktperiode",null,null,"Sesong"]
[{"$f":"Vaktliste!$A$2","v":1},{"$f":"B102","v":"4b"},null,null,{"$f":"$C$14","v":"nn4"}]
["X","Vaktperiode",null,null,null,null,"Vakans"]
[{"$f":"Vaktliste!$A$2","v":1},{"$f":"B104","v":"4b"},null,null,null,null,{"$f":"$C$14","v":"nn4"}]
["X",{"$f":"VLOOKUP(B102,Vaktperioder,2,0)","v":"Natt hverdag 0000 - 0600"},null,{"$f":"DCOUNTA(Vaktliste,5,$A101:$G102)","v":0},{"$f":"DCOUNTA(Vaktliste,6,$A103:$G104)","v":0},{"$f":"DCOUNTA(Vaktliste,7,$A105:$G106)","v":0}]
[{"$f":"Vaktliste!$A$2","v":1},"Timer",null,{"$f":"D107*DGET(Timer,3,$B101:$B102)","v":0},{"$f":"E107*DGET(Timer,3,$B101:$B102)","v":0},{"$f":"F107*DGET(Timer,3,B101:B102)","v":0}]
["X","Satser",null,{"$f":"IF(D108>0,DGET(Vaktperiode0,D$20,$B101:$B102),0)","v":0},{"$f":"IF(E108>0,DGET(Vaktperiode0,E$20,$B101:$B102),0)","v":0},{"$f":"IF(F108>0,DGET(Vaktperiode0,F$20,$B101:$B102),0)","v":0}]
[{"$f":"Vaktliste!$A$2","v":1},"Beløp",null,{"$f":"D109*D108","v":0},{"$f":"E109*E108","v":0},{"$f":"F109*F108","v":0},null,{"$f":"SUM(D110:F110)","v":0}]
["X","Vaktperiode",null,"Ordinær"]
[{"$f":"Vaktliste!$A$2","v":1},"4c",null,{"$f":"$C$14","v":"nn4"}]
["X","Vaktperiode",null,null,"Sesong"]
[{"$f":"Vaktliste!$A$2","v":1},{"$f":"B112","v":"4c"},null,null,{"$f":"$C$14","v":"nn4"}]
["X","Vaktperiode",null,null,null,null,"Vakans"]
[{"$f":"Vaktliste!$A$2","v":1},{"$f":"B114","v":"4c"},null,null,null,null,{"$f":"$C$14","v":"nn4"}]
["X",{"$f":"VLOOKUP(B112,Vaktperioder,2,0)","v":"Natt lørdag, søndag 2200 - 2400"},null,{"$f":"DCOUNTA(Vaktliste,5,$A111:$G112)","v":0},{"$f":"DCOUNTA(Vaktliste,6,$A113:$G114)","v":0},{"$f":"DCOUNTA(Vaktliste,7,$A115:$G116)","v":0}]
[{"$f":"Vaktliste!$A$2","v":1},"Timer",null,{"$f":"D117*DGET(Timer,3,$B111:$B112)","v":0},{"$f":"E117*DGET(Timer,3,$B111:$B112)","v":0},{"$f":"F117*DGET(Timer,3,B111:B112)","v":0}]
["X","Satser",null,{"$f":"IF(D118>0,DGET(Vaktperiode0,D$20,$B111:$B112),0)","v":0},{"$f":"IF(E118>0,DGET(Vaktperiode0,E$20,$B111:$B112),0)","v":0},{"$f":"IF(F118>0,DGET(Vaktperiode0,F$20,$B111:$B112),0)","v":0}]
[{"$f":"Vaktliste!$A$2","v":1},"Beløp",null,{"$f":"D119*D118","v":0},{"$f":"E119*E118","v":0},{"$f":"F119*F118","v":0},null,{"$f":"SUM(D120:F120)","v":0}]
["X","Vaktperiode",null,"Ordinær"]
[{"$f":"Vaktliste!$A$2","v":1},"4d",null,{"$f":"$C$14","v":"nn4"}]
["X","Vaktperiode",null,null,"Sesong"]
[{"$f":"Vaktliste!$A$2","v":1},{"$f":"B122","v":"4d"},null,null,{"$f":"$C$14","v":"nn4"}]
["X","Vaktperiode",null,null,null,null,"Vakans"]
[{"$f":"Vaktliste!$A$2","v":1},{"$f":"B124","v":"4d"},null,null,null,null,{"$f":"$C$14","v":"nn4"}]
["X",{"$f":"VLOOKUP(B122,Vaktperioder,2,0)","v":"Natt lørdag, søndag 0000 - 0600"},null,{"$f":"DCOUNTA(Vaktliste,5,$A121:$G122)","v":0},{"$f":"DCOUNTA(Vaktliste,6,$A123:$G124)","v":0},{"$f":"DCOUNTA(Vaktliste,7,$A125:$G126)","v":0}]
[{"$f":"Vaktliste!$A$2","v":1},"Timer",null,{"$f":"D127*DGET(Timer,3,$B121:$B122)","v":0},{"$f":"E127*DGET(Timer,3,$B121:$B122)","v":0},{"$f":"F127*DGET(Timer,3,B121:B122)","v":0}]
["X","Satser",null,{"$f":"IF(D128>0,DGET(Vaktperiode0,D$20,$B121:$B122),0)","v":0},{"$f":"IF(E128>0,DGET(Vaktperiode0,E$20,$B121:$B122),0)","v":0},{"$f":"IF(F128>0,DGET(Vaktperiode0,F$20,$B121:$B122),0)","v":0}]
[{"$f":"Vaktliste!$A$2","v":1},"Beløp",null,{"$f":"D129*D128","v":0},{"$f":"E129*E128","v":0},{"$f":"F129*F128","v":0},null,{"$f":"SUM(D130:F130)","v":0}]
["X","Vaktperiode",null,"Ordinær"]
[{"$f":"Vaktliste!$A$2","v":1},"4e",null,{"$f":"$C$14","v":"nn4"}]
["X","Vaktperiode",null,null,"Sesong"]
[{"$f":"Vaktliste!$A$2","v":1},{"$f":"B132","v":"4e"},null,null,{"$f":"$C$14","v":"nn4"}]
["X","Vaktperiode",null,null,null,null,"Vakans"]
[{"$f":"Vaktliste!$A$2","v":1},{"$f":"B134","v":"4e"},null,null,null,null,{"$f":"$C$14","v":"nn4"}]
["X",{"$f":"VLOOKUP(B132,Vaktperioder,2,0)","v":"Natt hellig- og høytidsdag 2200 - 2400"},null,{"$f":"DCOUNTA(Vaktliste,5,$A131:$G132)","v":0},{"$f":"DCOUNTA(Vaktliste,6,$A133:$G134)","v":0},{"$f":"DCOUNTA(Vaktliste,7,$A135:$G136)","v":0}]
[{"$f":"Vaktliste!$A$2","v":1},"Timer",null,{"$f":"D137*DGET(Timer,3,$B131:$B132)","v":0},{"$f":"E137*DGET(Timer,3,$B131:$B132)","v":0},{"$f":"F137*DGET(Timer,3,B131:B132)","v":0}]
["X","Satser",null,{"$f":"IF(D138>0,DGET(Vaktperiode0,D$20,$B131:$B132),0)","v":0},{"$f":"IF(E138>0,DGET(Vaktperiode0,E$20,$B131:$B132),0)","v":0},{"$f":"IF(F138>0,DGET(Vaktperiode0,F$20,$B131:$B132),0)","v":0}]
[{"$f":"Vaktliste!$A$2","v":1},"Beløp",null,{"$f":"D139*D138","v":0},{"$f":"E139*E138","v":0},{"$f":"F139*F138","v":0},null,{"$f":"SUM(D140:F140)","v":0}]
["X","Vaktperiode",null,"Ordinær"]
[{"$f":"Vaktliste!$A$2","v":1},"4f",null,{"$f":"$C$14","v":"nn4"}]
["X","Vaktperiode",null,null,"Sesong"]
[{"$f":"Vaktliste!$A$2","v":1},{"$f":"B142","v":"4f"},null,null,{"$f":"$C$14","v":"nn4"}]
["X","Vaktperiode",null,null,null,null,"Vakans"]
[{"$f":"Vaktliste!$A$2","v":1},{"$f":"B144","v":"4f"},null,null,null,null,{"$f":"$C$14","v":"nn4"}]
["X",{"$f":"VLOOKUP(B142,Vaktperioder,2,0)","v":"Natt hellig- og høytidsdag 0000 - 0600"},null,{"$f":"DCOUNTA(Vaktliste,5,$A141:$G142)","v":0},{"$f":"DCOUNTA(Vaktliste,6,$A143:$G144)","v":0},{"$f":"DCOUNTA(Vaktliste,7,$A145:$G146)","v":0}]
[{"$f":"Vaktliste!$A$2","v":1},"Timer",null,{"$f":"D147*DGET(Timer,3,$B141:$B142)","v":0},{"$f":"E147*DGET(Timer,3,$B141:$B142)","v":0},{"$f":"F147*DGET(Timer,3,B141:B142)","v":0}]
["X","Satser",null,{"$f":"IF(D148>0,DGET(Vaktperiode0,D$20,$B141:$B142),0)","v":0},{"$f":"IF(E148>0,DGET(Vaktperiode0,E$20,$B141:$B142),0)","v":0},{"$f":"IF(F148>0,DGET(Vaktperiode0,F$20,$B141:$B142),0)","v":0}]
[{"$f":"Vaktliste!$A$2","v":1},"Beløp",null,{"$f":"D149*D148","v":0},{"$f":"E149*E148","v":0},{"$f":"F149*F148","v":0},null,{"$f":"SUM(D150:F150)","v":0}]
[null,"Sum antall vakter / beløp",null,{"$f":"D28+D38+D48+D58+D68+D78+D88+D98+D108+D118+D128+D138+D148","v":0},{"$f":"E28+E38+E48+E58+E68+E78+E88+E98+E108+E118+E128+E138+E148","v":0},{"$f":"F28+F38+F48+F58+F68+F78+F88+F98+F108+F118+F128+F138+F148","v":0},null,{"$f":"SUM(H27:H150)","v":0}]

{"sheet":"nn (5)","index":5,"n_rows":151,"n_cols":8,"rows_kept":151,"cut":false,"hidden":false,"merged":[[150,5,150,6],[148,1,148,2],[148,5,148,6],[149,1,149,2],[149,5,149,6],[139,1,139,2],[139,5,139,6],[146,1,146,2],[146,5,146,6],[147,1,147,2],[127,1,127,2],[127,5,127,6],[128,1,128,2],[128,5,128,6],[129,1,129,2],[129,5,129,6],[147,5,147,6],[136,1,136,2],[136,5,136,6],[137,1,137,2],[137,5,137,6],[138,1,138,2],[138,5,138,6],[11,3,11,4],[3,2,3,6],[5,2,5,6],[9,2,9,4],[7,2,7,6],[126,1,126,2],[126,5,126,6],[27,1,27,2],[27,5,27,6],[28,1,28,2],[29,1,29,2],[29,5,29,6],[36,1,36,2],[36,5,36,6],[28,5,28,6],[16,3,16,6],[17,3,17,6],[19,5,19,6],[26,1,26,2],[26,5,26,6],[47,1,47,2],[47,5,47,6],[48,1,48,2],[48,5,48,6],[39,1,39,2],[39,5,39,6],[46,1,46,2],[46,5,46,6],[37,1,37,2],[37,5,37,6],[38,1,38,2],[38,5,38,6],[59,1,59,2],[59,5,59,6],[66,1,66,2],[66,5,66,6],[57,1,57,2],[57,5,57,6],[58,1,58,2],[58,5,58,6],[49,1,49,2],[49,5,49,6],[56,1,56,2],[56,5,56,6],[77,1,77,2],[77,5,77,6],[78,1,78,2],[78,5,78,6],[69,1,69,2],[69,5,69,6],[76,1,76,2],[76,5,76,6],[67,1,67,2],[67,5,67,6],[68,1,68,2],[68,5,68,6],[89,1,89,2],[89,5,89,6],[96,1,96,2],[96,5,96,6],[87,1,87,2],[87,5,87,6],[88,1,88,2],[88,5,88,6],[79,1,79,2],[79,5,79,6],[86,1,86,2],[86,5,86,6],[12,2,12,6],[119,1,119,2],[119,5,119,6],[13,2,13,3],[117,1,117,2],[117,5,117,6],[118,1,118,2],[118,5,118,6],[109,1,109,2],[109,5,109,6],[116,1,116,2],[116,5,116,6],[107,1,107,2],[107,5,107,6],[108,1,108,2],[108,5,108,6],[99,1,99,2],[99,5,99,6],[106,1,106,2],[106,5,106,6],[97,1,97,2],[97,5,97,6],[98,1,98,2],[98,5,98,6]]}
[null,"REGNING"]
[null,"GODTGJØRING FOR DELTAKELSE I KLINISK VETERINÆRVAKT"]
[]
[null,"Navn:",null,null,null,null,null,"Fakturadato:"]
[null,null,null,null,null,null,null,"Forfallsdato:"]
[null,"Adresse:"]
[]
[null,"Postnummer, -sted:"]
[]
[null,"Bankgirokontonr:"]
[]
[null,"Organisasjonsnummer:","NO",null,null,"MVA"]
[null,"Fullt navn:"]
[null,"Initialer:","nn5"]
[null,"Regningen gjelder vakttjeneste i vaktområdet (jfr. vaktliste):"]
[null,{"$f":"Vaktliste!E1","v":"Primært vaktområde"}]
[null,"for perioden:"]
[null,{"$f":"Vaktliste!B3","v":"2026-01-01"},null,{"$f":"Vaktliste!E4","v":0}]
[]
[null,"Vakttype - antall vakter",null,"Ordinær","Sesong","Vakans",null,"Beløp"]
["X","Vaktperiode",null,"Ordinær"]
[{"$f":"Vaktliste!$A$2","v":1},"1a",null,{"$f":"$C$14","v":"nn5"}]
["X","Vaktperiode",null,null,"Sesong"]
[{"$f":"Vaktliste!$A$2","v":1},{"$f":"B22","v":"1a"},null,null,{"$f":"$C$14","v":"nn5"}]
["X","Vaktperiode",null,null,null,null,"Vakans"]
[{"$f":"Vaktliste!$A$2","v":1},{"$f":"B24","v":"1a"},null,null,null,null,{"$f":"$C$14","v":"nn5"}]
["X",{"$f":"VLOOKUP(B22,Vaktperioder,2,0)","v":"Hverdag, kveld 1600 - 2200"},null,{"$f":"DCOUNTA(Vaktliste,5,$A21:$G22)","v":0},{"$f":"DCOUNTA(Vaktliste,6,$A23:$G24)","v":0},{"$f":"DCOUNTA(Vaktliste,7,$A25:$G26)","v":0}]
[{"$f":"Vaktliste!$A$2","v":1},"Timer",null,{"$f":"D27*DGET(Timer,3,$B21:$B22)","v":0},{"$f":"E27*DGET(Timer,3,$B21:$B22)","v":0},{"$f":"F27*DGET(Timer,3,B21:B22)","v":0}]
["X","Satser",null,{"$f":"IF(D28>0,DGET(Vaktperiode0,D$20,$B21:$B22),0)","v":0},{"$f":"IF(E28>0,DGET(Vaktperiode0,E$20,$B21:$B22),0)","v":0},{"$f":"IF(F28>0,DGET(Vaktperiode0,F$20,$B21:$B22),0)","v":0}]
[{"$f":"Vaktliste!$A$2","v":1},"Beløp",null,{"$f":"D29*D28","v":0},{"$f":"E29*E28","v":0},{"$f":"F29*F28","v":0},null,{"$f":"SUM(D30:F30)","v":0}]
["X","Vaktperiode",null,"Ordinær"]
[{"$f":"Vaktliste!$A$2","v":1},"2a",null,{"$f":"$C$14","v":"nn5"}]
["X","Vaktperiode",null,null,"Sesong"]
[{"$f":"Vaktliste!$A$2","v":1},{"$f":"B32","v":"2a"},null,null,{"$f":"$C$14","v":"nn5"}]
["X","Vaktperiode",null,null,null,null,"Vakans"]
[{"$f":"Vaktliste!$A$2","v":1},{"$f":"B34","v":"2a"},null,null,null,null,{"$f":"$C$14","v":"nn5"}]
["X",{"$f":"VLOOKUP(B32,Vaktperioder,2,0)","v":"Hverdag, morgen 0600 - 0800"},null,{"$f":"DCOUNTA(Vaktliste,5,$A31:$G32)","v":0},{"$f":"DCOUNTA(Vaktliste,6,$A33:$G34)","v":0},{"$f":"DCOUNTA(Vaktliste,7,$A35:$G36)","v":0}]
[{"$f":"Vaktliste!$A$2","v":1},"Timer",null,{"$f":"D37*DGET(Timer,3,$B31:$B32)","v":0},{"$f":"E37*DGET(Timer,3,$B31:$B32)","v":0},{"$f":"F37*DGET(Timer,3,B31:B32)","v":0}]
["X","Satser",null,{"$f":"IF(D38>0,DGET(Vaktperiode0,D$20,$B31:$B32),0)","v":0},{"$f":"IF(E38>0,DGET(Vaktperiode0,E$20,$B31:$B32),0)","v":0},{"$f":"IF(F38>0,DGET(Vaktperiode0,F$20,$B31:$B32),0)","v":0}]
[{"$f":"Vaktliste!$A$2","v":1},"Beløp",null,{"$f":"D39*D38","v":0},{"$f":"E39*E38","v":0},{"$f":"F39*F38","v":0},null,{"$f":"SUM(D40:F40)","v":0}]
["X","Vaktperiode",null,"Ordinær"]
[{"$f":"Vaktliste!$A$2","v":1},"3a",null,{"$f":"$C$14","v":"nn5"}]
["X","Vaktperiode",null,null,"Sesong"]
[{"$f":"Vaktliste!$A$2","v":1},{"$f":"B42","v":"3a"},null,null,{"$f":"$C$14","v":"nn5"}]
["X","Vaktperiode",null,null,null,null,"Vakans"]
[{"$f":"Vaktliste!$A$2","v":1},{"$f":"B44","v":"3a"},null,null,null,null,{"$f":"$C$14","v":"nn5"}]
["X",{"$f":"VLOOKUP(B42,Vaktperioder,2,0)","v":"Lørdag, søndag 0600 - 2200"},null,{"$f":"DCOUNTA(Vaktliste,5,$A41:$G42)","v":0},{"$f":"DCOUNTA(Vaktliste,6,$A43:$G44)","v":0},{"$f":"DCOUNTA(Vaktliste,7,$A45:$G46)","v":0}]
[{"$f":"Vaktliste!$A$2","v":1},"Timer",null,{"$f":"D47*DGET(Timer,3,$B41:$B42)","v":0},{"$f":"E47*DGET(Timer,3,$B41:$B42)","v":0},{"$f":"F47*DGET(Timer,3,B41:B42)","v":0}]
["X","Satser",null,{"$f":"IF(D48>0,DGET(Vaktperiode0,D$20,$B41:$B42),0)","v":0},{"$f":"IF(E48>0,DGET(Vaktperiode0,E$20,$B41:$B42),0)","v":0},{"$f":"IF(F48>0,DGET(Vaktperiode0,F$20,$B41:$B42),0)","v":0}]
[{"$f":"Vaktliste!$A$2","v":1},"Beløp",null,{"$f":"D49*D48","v":0},{"$f":"E49*E48","v":0},{"$f":"F49*F48","v":0},null,{"$f":"SUM(D50:F50)","v":0}]
["X","Vaktperiode",null,"Ordinær"]
[{"$f":"Vaktliste!$A$2","v":1},"3b",null,{"$f":"$C$14","v":"nn5"}]
["X","Vaktperiode",null,null,"Sesong"]
[{"$f":"Vaktliste!$A$2","v":1},{"$f":"B52","v":"3b"},null,null,{"$f":"$C$14","v":"nn5"}]
["X","Vaktperiode",null,null,null,null,"Vakans"]
[{"$f":"Vaktliste!$A$2","v":1},{"$f":"B54","v":"3b"},null,null,null,null,{"$f":"$C$14","v":"nn5"}]
["X",{"$f":"VLOOKUP(B52,Vaktperioder,2,0)","v":"Hellig- og høytidsdag 0600 - 2200"},null,{"$f":"DCOUNTA(Vaktliste,5,$A51:$G52)","v":0},{"$f":"DCOUNTA(Vaktliste,6,$A53:$G54)","v":0},{"$f":"DCOUNTA(Vaktliste,7,$A55:$G56)","v":0}]
[{"$f":"Vaktliste!$A$2","v":1},"Timer",null,{"$f":"D57*DGET(Timer,3,$B51:$B52)","v":0},{"$f":"E57*DGET(Timer,3,$B51:$B52)","v":0},{"$f":"F57*DGET(Timer,3,B51:B52)","v":0}]
["X","Satser",null,{"$f":"IF(D58>0,DGET(Vaktperiode0,D$20,$B51:$B52),0)","v":0},{"$f":"IF(E58>0,DGET(Vaktperiode0,E$20,$B51:$B52),0)","v":0},{"$f":"IF(F58>0,DGET(Vaktperiode0,F$20,$B51:$B52),0)","v":0}]
[{"$f":"Vaktliste!$A$2","v":1},"Beløp",null,{"$f":"D59*D58","v":0},{"$f":"E59*E58","v":0},{"$f":"F59*F58","v":0},null,{"$f":"SUM(D60:F60)","v":0}]
["X","Vaktperiode",null,"Ordinær"]
[{"$f":"Vaktliste!$A$2","v":1},"3c",null,{"$f":"$C$14","v":"nn5"}]
["X","Vaktperiode",null,null,"Sesong"]
[{"$f":"Vaktliste!$A$2","v":1},{"$f":"B62","v":"3c"},null,null,{"$f":"$C$14","v":"nn5"}]
["X","Vaktperiode",null,null,null,null,"Vakans"]
[{"$f":"Vaktliste!$A$2","v":1},{"$f":"B64","v":"3c"},null,null,null,null,{"$f":"$C$14","v":"nn5"}]
["X",{"$f":"VLOOKUP(B62,Vaktperioder,2,0)","v":"Jul- og nyttårsaften 0600 - 1200"},null,{"$f":"DCOUNTA(Vaktliste,5,$A61:$G62)","v":0},{"$f":"DCOUNTA(Vaktliste,6,$A63:$G64)","v":0},{"$f":"DCOUNTA(Vaktliste,7,$A65:$G66)","v":0}]
[{"$f":"Vaktliste!$A$2","v":1},"Timer",null,{"$f":"D67*DGET(Timer,3,$B61:$B62)","v":0},{"$f":"E67*DGET(Timer,3,$B61:$B62)","v":0},{"$f":"F67*DGET(Timer,3,B61:B62)","v":0}]
["X","Satser",null,{"$f":"IF(D68>0,DGET(Vaktperiode0,D$20,$B61:$B62),0)","v":0},{"$f":"IF(E68>0,DGET(Vaktperiode0,E$20,$B61:$B62),0)","v":0},{"$f":"IF(F68>0,DGET(Vaktperiode0,F$20,$B61:$B62),0)","v":0}]
[{"$f":"Vaktliste!$A$2","v":1},"Beløp",null,{"$f":"D69*D68","v":0},{"$f":"E69*E68","v":0},{"$f":"F69*F68","v":0},null,{"$f":"SUM(D70:F70)","v":0}]
["X","Vaktperiode",null,"Ordinær"]
[{"$f":"Vaktliste!$A$2","v":1},"3d",null,{"$f":"$C$14","v":"nn5"}]
["X","Vaktperiode",null,null,"Sesong"]
[{"$f":"Vaktliste!$A$2","v":1},{"$f":"B72","v":"3d"},null,null,{"$f":"$C$14","v":"nn5"}]
["X","Vaktperiode",null,null,null,null,"Vakans"]
[{"$f":"Vaktliste!$A$2","v":1},{"$f":"B74","v":"3d"},null,null,null,null,{"$f":"$C$14","v":"nn5"}]
["X",{"$f":"VLOOKUP(B72,Vaktperioder,2,0)","v":"Påske-, jul- og nyttårsaften 1200 - 2200"},null,{"$f":"DCOUNTA(Vaktliste,5,$A71:$G72)","v":0},{"$f":"DCOUNTA(Vaktliste,6,$A73:$G74)","v":0},{"$f":"DCOUNTA(Vaktliste,7,$A75:$G76)","v":0}]
[{"$f":"Vaktliste!$A$2","v":1},"Timer",null,{"$f":"D77*DGET(Timer,3,$B71:$B72)","v":0},{"$f":"E77*DGET(Timer,3,$B71:$B72)","v":0},{"$f":"F77*DGET(Timer,3,B71:B72)","v":0}]
["X","Satser",null,{"$f":"IF(D78>0,DGET(Vaktperiode0,D$20,$B71:$B72),0)","v":0},{"$f":"IF(E78>0,DGET(Vaktperiode0,E$20,$B71:$B72),0)","v":0},{"$f":"IF(F78>0,DGET(Vaktperiode0,F$20,$B71:$B72),0)","v":0}]
[{"$f":"Vaktliste!$A$2","v":1},"Beløp",null,{"$f":"D79*D78","v":0},{"$f":"E79*E78","v":0},{"$f":"F79*F78","v":0},null,{"$f":"SUM(D80:F80)","v":0}]
["X","Vaktperiode",null,"Ordinær"]
[{"$f":"Vaktliste!$A$2","v":1},"3e",null,{"$f":"$C$14","v":"nn5"}]
["X","Vaktperiode",null,null,"Sesong"]
[{"$f":"Vaktliste!$A$2","v":1},{"$f":"B82","v":"3e"},null,null,{"$f":"$C$14","v":"nn5"}]
["X","Vaktperiode",null,null,null,null,"Vakans"]
[{"$f":"Vaktliste!$A$2","v":1},{"$f":"B84","v":"3e"},null,null,null,null,{"$f":"$C$14","v":"nn5"}]
["X",{"$f":"VLOOKUP(B82,Vaktperioder,2,0)","v":"Påskeaften 0600 - 1200"},null,{"$f":"DCOUNTA(Vaktliste,5,$A81:$G82)","v":0},{"$f":"DCOUNTA(Vaktliste,6,$A83:$G84)","v":0},{"$f":"DCOUNTA(Vaktliste,7,$A85:$G86)","v":0}]
[{"$f":"Vaktliste!$A$2","v":1},"Timer",null,{"$f":"D87*DGET(Timer,3,$B81:$B82)","v":0},{"$f":"E87*DGET(Timer,3,$B81:$B82)","v":0},{"$f":"F87*DGET(Timer,3,B81:B82)","v":0}]
["X","Satser",null,{"$f":"IF(D88>0,DGET(Vaktperiode0,D$20,$B81:$B82),0)","v":0},{"$f":"IF(E88>0,DGET(Vaktperiode0,E$20,$B81:$B82),0)","v":0},{"$f":"IF(F88>0,DGET(Vaktperiode0,F$20,$B81:$B82),0)","v":0}]
[{"$f":"Vaktliste!$A$2","v":1},"Beløp",null,{"$f":"D89*D88","v":0},{"$f":"E89*E88","v":0},{"$f":"F89*F88","v":0},null,{"$f":"SUM(D90:F90)","v":0}]
["X","Vaktperiode",null,"Ordinær"]
[{"$f":"Vaktliste!$A$2","v":1},"4a",null,{"$f":"$C$14","v":"nn5"}]
["X","Vaktperiode",null,null,"Sesong"]
[{"$f":"Vaktliste!$A$2","v":1},{"$f":"B92","v":"4a"},null,null,{"$f":"$C$14","v":"nn5"}]
["X","Vaktperiode",null,null,null,null,"Vakans"]
[{"$f":"Vaktliste!$A$2","v":1},{"$f":"B94","v":"4a"},null,null,null,null,{"$f":"$C$14","v":"nn5"}]
["X",{"$f":"VLOOKUP(B92,Vaktperioder,2,0)","v":"Natt hverdag 2200 - 2400"},null,{"$f":"DCOUNTA(Vaktliste,5,$A91:$G92)","v":0},{"$f":"DCOUNTA(Vaktliste,6,$A93:$G94)","v":0},{"$f":"DCOUNTA(Vaktliste,7,$A95:$G96)","v":0}]
[{"$f":"Vaktliste!$A$2","v":1},"Timer",null,{"$f":"D97*DGET(Timer,3,$B91:$B92)","v":0},{"$f":"E97*DGET(Timer,3,$B91:$B92)","v":0},{"$f":"F97*DGET(Timer,3,B91:B92)","v":0}]
["X","Satser",null,{"$f":"IF(D98>0,DGET(Vaktperiode0,D$20,$B91:$B92),0)","v":0},{"$f":"IF(E98>0,DGET(Vaktperiode0,E$20,$B91:$B92),0)","v":0},{"$f":"IF(F98>0,DGET(Vaktperiode0,F$20,$B91:$B92),0)","v":0}]
[{"$f":"Vaktliste!$A$2","v":1},"Beløp",null,{"$f":"D99*D98","v":0},{"$f":"E99*E98","v":0},{"$f":"F99*F98","v":0},null,{"$f":"SUM(D100:F100)","v":0}]
["X","Vaktperiode",null,"Ordinær"]
[{"$f":"Vaktliste!$A$2","v":1},"4b",null,{"$f":"$C$14","v":"nn5"}]
["X","Vaktperiode",null,null,"Sesong"]
[{"$f":"Vaktliste!$A$2","v":1},{"$f":"B102","v":"4b"},null,null,{"$f":"$C$14","v":"nn5"}]
["X","Vaktperiode",null,null,null,null,"Vakans"]
[{"$f":"Vaktliste!$A$2","v":1},{"$f":"B104","v":"4b"},null,null,null,null,{"$f":"$C$14","v":"nn5"}]
["X",{"$f":"VLOOKUP(B102,Vaktperioder,2,0)","v":"Natt hverdag 0000 - 0600"},null,{"$f":"DCOUNTA(Vaktliste,5,$A101:$G102)","v":0},{"$f":"DCOUNTA(Vaktliste,6,$A103:$G104)","v":0},{"$f":"DCOUNTA(Vaktliste,7,$A105:$G106)","v":0}]
[{"$f":"Vaktliste!$A$2","v":1},"Timer",null,{"$f":"D107*DGET(Timer,3,$B101:$B102)","v":0},{"$f":"E107*DGET(Timer,3,$B101:$B102)","v":0},{"$f":"F107*DGET(Timer,3,B101:B102)","v":0}]
["X","Satser",null,{"$f":"IF(D108>0,DGET(Vaktperiode0,D$20,$B101:$B102),0)","v":0},{"$f":"IF(E108>0,DGET(Vaktperiode0,E$20,$B101:$B102),0)","v":0},{"$f":"IF(F108>0,DGET(Vaktperiode0,F$20,$B101:$B102),0)","v":0}]
[{"$f":"Vaktliste!$A$2","v":1},"Beløp",null,{"$f":"D109*D108","v":0},{"$f":"E109*E108","v":0},{"$f":"F109*F108","v":0},null,{"$f":"SUM(D110:F110)","v":0}]
["X","Vaktperiode",null,"Ordinær"]
[{"$f":"Vaktliste!$A$2","v":1},"4c",null,{"$f":"$C$14","v":"nn5"}]
["X","Vaktperiode",null,null,"Sesong"]
[{"$f":"Vaktliste!$A$2","v":1},{"$f":"B112","v":"4c"},null,null,{"$f":"$C$14","v":"nn5"}]
["X","Vaktperiode",null,null,null,null,"Vakans"]
[{"$f":"Vaktliste!$A$2","v":1},{"$f":"B114","v":"4c"},null,null,null,null,{"$f":"$C$14","v":"nn5"}]
["X",{"$f":"VLOOKUP(B112,Vaktperioder,2,0)","v":"Natt lørdag, søndag 2200 - 2400"},null,{"$f":"DCOUNTA(Vaktliste,5,$A111:$G112)","v":0},{"$f":"DCOUNTA(Vaktliste,6,$A113:$G114)","v":0},{"$f":"DCOUNTA(Vaktliste,7,$A115:$G116)","v":0}]
[{"$f":"Vaktliste!$A$2","v":1},"Timer",null,{"$f":"D117*DGET(Timer,3,$B111:$B112)","v":0},{"$f":"E117*DGET(Timer,3,$B111:$B112)","v":0},{"$f":"F117*DGET(Timer,3,B111:B112)","v":0}]
["X","Satser",null,{"$f":"IF(D118>0,DGET(Vaktperiode0,D$20,$B111:$B112),0)","v":0},{"$f":"IF(E118>0,DGET(Vaktperiode0,E$20,$B111:$B112),0)","v":0},{"$f":"IF(F118>0,DGET(Vaktperiode0,F$20,$B111:$B112),0)","v":0}]
[{"$f":"Vaktliste!$A$2","v":1},"Beløp",null,{"$f":"D119*D118","v":0},{"$f":"E119*E118","v":0},{"$f":"F119*F118","v":0},null,{"$f":"SUM(D120:F120)","v":0}]
["X","Vaktperiode",null,"Ordinær"]
[{"$f":"Vaktliste!$A$2","v":1},"4d",null,{"$f":"$C$14","v":"nn5"}]
["X","Vaktperiode",null,null,"Sesong"]
[{"$f":"Vaktliste!$A$2","v":1},{"$f":"B122","v":"4d"},null,null,{"$f":"$C$14","v":"nn5"}]
["X","Vaktperiode",null,null,null,null,"Vakans"]
[{"$f":"Vaktliste!$A$2","v":1},{"$f":"B124","v":"4d"},null,null,null,null,{"$f":"$C$14","v":"nn5"}]
["X",{"$f":"VLOOKUP(B122,Vaktperioder,2,0)","v":"Natt lørdag, søndag 0000 - 0600"},null,{"$f":"DCOUNTA(Vaktliste,5,$A121:$G122)","v":0},{"$f":"DCOUNTA(Vaktliste,6,$A123:$G124)","v":0},{"$f":"DCOUNTA(Vaktliste,7,$A125:$G126)","v":0}]
[{"$f":"Vaktliste!$A$2","v":1},"Timer",null,{"$f":"D127*DGET(Timer,3,$B121:$B122)","v":0},{"$f":"E127*DGET(Timer,3,$B121:$B122)","v":0},{"$f":"F127*DGET(Timer,3,B121:B122)","v":0}]
["X","Satser",null,{"$f":"IF(D128>0,DGET(Vaktperiode0,D$20,$B121:$B122),0)","v":0},{"$f":"IF(E128>0,DGET(Vaktperiode0,E$20,$B121:$B122),0)","v":0},{"$f":"IF(F128>0,DGET(Vaktperiode0,F$20,$B121:$B122),0)","v":0}]
[{"$f":"Vaktliste!$A$2","v":1},"Beløp",null,{"$f":"D129*D128","v":0},{"$f":"E129*E128","v":0},{"$f":"F129*F128","v":0},null,{"$f":"SUM(D130:F130)","v":0}]
["X","Vaktperiode",null,"Ordinær"]
[{"$f":"Vaktliste!$A$2","v":1},"4e",null,{"$f":"$C$14","v":"nn5"}]
["X","Vaktperiode",null,null,"Sesong"]
[{"$f":"Vaktliste!$A$2","v":1},{"$f":"B132","v":"4e"},null,null,{"$f":"$C$14","v":"nn5"}]
["X","Vaktperiode",null,null,null,null,"Vakans"]
[{"$f":"Vaktliste!$A$2","v":1},{"$f":"B134","v":"4e"},null,null,null,null,{"$f":"$C$14","v":"nn5"}]
["X",{"$f":"VLOOKUP(B132,Vaktperioder,2,0)","v":"Natt hellig- og høytidsdag 2200 - 2400"},null,{"$f":"DCOUNTA(Vaktliste,5,$A131:$G132)","v":0},{"$f":"DCOUNTA(Vaktliste,6,$A133:$G134)","v":0},{"$f":"DCOUNTA(Vaktliste,7,$A135:$G136)","v":0}]
[{"$f":"Vaktliste!$A$2","v":1},"Timer",null,{"$f":"D137*DGET(Timer,3,$B131:$B132)","v":0},{"$f":"E137*DGET(Timer,3,$B131:$B132)","v":0},{"$f":"F137*DGET(Timer,3,B131:B132)","v":0}]
["X","Satser",null,{"$f":"IF(D138>0,DGET(Vaktperiode0,D$20,$B131:$B132),0)","v":0},{"$f":"IF(E138>0,DGET(Vaktperiode0,E$20,$B131:$B132),0)","v":0},{"$f":"IF(F138>0,DGET(Vaktperiode0,F$20,$B131:$B132),0)","v":0}]
[{"$f":"Vaktliste!$A$2","v":1},"Beløp",null,{"$f":"D139*D138","v":0},{"$f":"E139*E138","v":0},{"$f":"F139*F138","v":0},null,{"$f":"SUM(D140:F140)","v":0}]
["X","Vaktperiode",null,"Ordinær"]
[{"$f":"Vaktliste!$A$2","v":1},"4f",null,{"$f":"$C$14","v":"nn5"}]
["X","Vaktperiode",null,null,"Sesong"]
[{"$f":"Vaktliste!$A$2","v":1},{"$f":"B142","v":"4f"},null,null,{"$f":"$C$14","v":"nn5"}]
["X","Vaktperiode",null,null,null,null,"Vakans"]
[{"$f":"Vaktliste!$A$2","v":1},{"$f":"B144","v":"4f"},null,null,null,null,{"$f":"$C$14","v":"nn5"}]
["X",{"$f":"VLOOKUP(B142,Vaktperioder,2,0)","v":"Natt hellig- og høytidsdag 0000 - 0600"},null,{"$f":"DCOUNTA(Vaktliste,5,$A141:$G142)","v":0},{"$f":"DCOUNTA(Vaktliste,6,$A143:$G144)","v":0},{"$f":"DCOUNTA(Vaktliste,7,$A145:$G146)","v":0}]
[{"$f":"Vaktliste!$A$2","v":1},"Timer",null,{"$f":"D147*DGET(Timer,3,$B141:$B142)","v":0},{"$f":"E147*DGET(Timer,3,$B141:$B142)","v":0},{"$f":"F147*DGET(Timer,3,B141:B142)","v":0}]
["X","Satser",null,{"$f":"IF(D148>0,DGET(Vaktperiode0,D$20,$B141:$B142),0)","v":0},{"$f":"IF(E148>0,DGET(Vaktperiode0,E$20,$B141:$B142),0)","v":0},{"$f":"IF(F148>0,DGET(Vaktperiode0,F$20,$B141:$B142),0)","v":0}]
[{"$f":"Vaktliste!$A$2","v":1},"Beløp",null,{"$f":"D149*D148","v":0},{"$f":"E149*E148","v":0},{"$f":"F149*F148","v":0},null,{"$f":"SUM(D150:F150)","v":0}]
[null,"Sum antall vakter / beløp",null,{"$f":"D28+D38+D48+D58+D68+D78+D88+D98+D108+D118+D128+D138+D148","v":0},{"$f":"E28+E38+E48+E58+E68+E78+E88+E98+E108+E118+E128+E138+E148","v":0},{"$f":"F28+F38+F48+F58+F68+F78+F88+F98+F108+F118+F128+F138+F148","v":0},null,{"$f":"SUM(H27:H150)","v":0}]

{"sheet":"nn (6)","index":6,"n_rows":151,"n_cols":8,"rows_kept":151,"cut":false,"hidden":false,"merged":[[150,5,150,6],[148,1,148,2],[148,5,148,6],[149,1,149,2],[149,5,149,6],[139,1,139,2],[139,5,139,6],[146,1,146,2],[146,5,146,6],[147,1,147,2],[127,1,127,2],[127,5,127,6],[128,1,128,2],[128,5,128,6],[129,1,129,2],[129,5,129,6],[147,5,147,6],[136,1,136,2],[136,5,136,6],[137,1,137,2],[137,5,137,6],[138,1,138,2],[138,5,138,6],[11,3,11,4],[3,2,3,6],[5,2,5,6],[9,2,9,4],[7,2,7,6],[126,1,126,2],[126,5,126,6],[27,1,27,2],[27,5,27,6],[28,1,28,2],[29,1,29,2],[29,5,29,6],[36,1,36,2],[36,5,36,6],[28,5,28,6],[16,3,16,6],[17,3,17,6],[19,5,19,6],[26,1,26,2],[26,5,26,6],[47,1,47,2],[47,5,47,6],[48,1,48,2],[48,5,48,6],[39,1,39,2],[39,5,39,6],[46,1,46,2],[46,5,46,6],[37,1,37,2],[37,5,37,6],[38,1,38,2],[38,5,38,6],[59,1,59,2],[59,5,59,6],[66,1,66,2],[66,5,66,6],[57,1,57,2],[57,5,57,6],[58,1,58,2],[58,5,58,6],[49,1,49,2],[49,5,49,6],[56,1,56,2],[56,5,56,6],[77,1,77,2],[77,5,77,6],[78,1,78,2],[78,5,78,6],[69,1,69,2],[69,5,69,6],[76,1,76,2],[76,5,76,6],[67,1,67,2],[67,5,67,6],[68,1,68,2],[68,5,68,6],[89,1,89,2],[89,5,89,6],[96,1,96,2],[96,5,96,6],[87,1,87,2],[87,5,87,6],[88,1,88,2],[88,5,88,6],[79,1,79,2],[79,5,79,6],[86,1,86,2],[86,5,86,6],[12,2,12,6],[119,1,119,2],[119,5,119,6],[13,2,13,3],[117,1,117,2],[117,5,117,6],[118,1,118,2],[118,5,118,6],[109,1,109,2],[109,5,109,6],[116,1,116,2],[116,5,116,6],[107,1,107,2],[107,5,107,6],[108,1,108,2],[108,5,108,6],[99,1,99,2],[99,5,99,6],[106,1,106,2],[106,5,106,6],[97,1,97,2],[97,5,97,6],[98,1,98,2],[98,5,98,6]]}
[null,"REGNING"]
[null,"GODTGJØRING FOR DELTAKELSE I KLINISK VETERINÆRVAKT"]
[]
[null,"Navn:",null,null,null,null,null,"Fakturadato:"]
[null,null,null,null,null,null,null,"Forfallsdato:"]
[null,"Adresse:"]
[]
[null,"Postnummer, -sted:"]
[]
[null,"Bankgirokontonr:"]
[]
[null,"Organisasjonsnummer:","NO",null,null,"MVA"]
[null,"Fullt navn:"]
[null,"Initialer:","nn6"]
[null,"Regningen gjelder vakttjeneste i vaktområdet (jfr. vaktliste):"]
[null,{"$f":"Vaktliste!E1","v":"Primært vaktområde"}]
[null,"for perioden:"]
[null,{"$f":"Vaktliste!B3","v":"2026-01-01"},null,{"$f":"Vaktliste!E4","v":0}]
[]
[null,"Vakttype - antall vakter",null,"Ordinær","Sesong","Vakans",null,"Beløp"]
["X","Vaktperiode",null,"Ordinær"]
[{"$f":"Vaktliste!$A$2","v":1},"1a",null,{"$f":"$C$14","v":"nn6"}]
["X","Vaktperiode",null,null,"Sesong"]
[{"$f":"Vaktliste!$A$2","v":1},{"$f":"B22","v":"1a"},null,null,{"$f":"$C$14","v":"nn6"}]
["X","Vaktperiode",null,null,null,null,"Vakans"]
[{"$f":"Vaktliste!$A$2","v":1},{"$f":"B24","v":"1a"},null,null,null,null,{"$f":"$C$14","v":"nn6"}]
["X",{"$f":"VLOOKUP(B22,Vaktperioder,2,0)","v":"Hverdag, kveld 1600 - 2200"},null,{"$f":"DCOUNTA(Vaktliste,5,$A21:$G22)","v":0},{"$f":"DCOUNTA(Vaktliste,6,$A23:$G24)","v":0},{"$f":"DCOUNTA(Vaktliste,7,$A25:$G26)","v":0}]
[{"$f":"Vaktliste!$A$2","v":1},"Timer",null,{"$f":"D27*DGET(Timer,3,$B21:$B22)","v":0},{"$f":"E27*DGET(Timer,3,$B21:$B22)","v":0},{"$f":"F27*DGET(Timer,3,B21:B22)","v":0}]
["X","Satser",null,{"$f":"IF(D28>0,DGET(Vaktperiode0,D$20,$B21:$B22),0)","v":0},{"$f":"IF(E28>0,DGET(Vaktperiode0,E$20,$B21:$B22),0)","v":0},{"$f":"IF(F28>0,DGET(Vaktperiode0,F$20,$B21:$B22),0)","v":0}]
[{"$f":"Vaktliste!$A$2","v":1},"Beløp",null,{"$f":"D29*D28","v":0},{"$f":"E29*E28","v":0},{"$f":"F29*F28","v":0},null,{"$f":"SUM(D30:F30)","v":0}]
["X","Vaktperiode",null,"Ordinær"]
[{"$f":"Vaktliste!$A$2","v":1},"2a",null,{"$f":"$C$14","v":"nn6"}]
["X","Vaktperiode",null,null,"Sesong"]
[{"$f":"Vaktliste!$A$2","v":1},{"$f":"B32","v":"2a"},null,null,{"$f":"$C$14","v":"nn6"}]
["X","Vaktperiode",null,null,null,null,"Vakans"]
[{"$f":"Vaktliste!$A$2","v":1},{"$f":"B34","v":"2a"},null,null,null,null,{"$f":"$C$14","v":"nn6"}]
["X",{"$f":"VLOOKUP(B32,Vaktperioder,2,0)","v":"Hverdag, morgen 0600 - 0800"},null,{"$f":"DCOUNTA(Vaktliste,5,$A31:$G32)","v":0},{"$f":"DCOUNTA(Vaktliste,6,$A33:$G34)","v":0},{"$f":"DCOUNTA(Vaktliste,7,$A35:$G36)","v":0}]
[{"$f":"Vaktliste!$A$2","v":1},"Timer",null,{"$f":"D37*DGET(Timer,3,$B31:$B32)","v":0},{"$f":"E37*DGET(Timer,3,$B31:$B32)","v":0},{"$f":"F37*DGET(Timer,3,B31:B32)","v":0}]
["X","Satser",null,{"$f":"IF(D38>0,DGET(Vaktperiode0,D$20,$B31:$B32),0)","v":0},{"$f":"IF(E38>0,DGET(Vaktperiode0,E$20,$B31:$B32),0)","v":0},{"$f":"IF(F38>0,DGET(Vaktperiode0,F$20,$B31:$B32),0)","v":0}]
[{"$f":"Vaktliste!$A$2","v":1},"Beløp",null,{"$f":"D39*D38","v":0},{"$f":"E39*E38","v":0},{"$f":"F39*F38","v":0},null,{"$f":"SUM(D40:F40)","v":0}]
["X","Vaktperiode",null,"Ordinær"]
[{"$f":"Vaktliste!$A$2","v":1},"3a",null,{"$f":"$C$14","v":"nn6"}]
["X","Vaktperiode",null,null,"Sesong"]
[{"$f":"Vaktliste!$A$2","v":1},{"$f":"B42","v":"3a"},null,null,{"$f":"$C$14","v":"nn6"}]
["X","Vaktperiode",null,null,null,null,"Vakans"]
[{"$f":"Vaktliste!$A$2","v":1},{"$f":"B44","v":"3a"},null,null,null,null,{"$f":"$C$14","v":"nn6"}]
["X",{"$f":"VLOOKUP(B42,Vaktperioder,2,0)","v":"Lørdag, søndag 0600 - 2200"},null,{"$f":"DCOUNTA(Vaktliste,5,$A41:$G42)","v":0},{"$f":"DCOUNTA(Vaktliste,6,$A43:$G44)","v":0},{"$f":"DCOUNTA(Vaktliste,7,$A45:$G46)","v":0}]
[{"$f":"Vaktliste!$A$2","v":1},"Timer",null,{"$f":"D47*DGET(Timer,3,$B41:$B42)","v":0},{"$f":"E47*DGET(Timer,3,$B41:$B42)","v":0},{"$f":"F47*DGET(Timer,3,B41:B42)","v":0}]
["X","Satser",null,{"$f":"IF(D48>0,DGET(Vaktperiode0,D$20,$B41:$B42),0)","v":0},{"$f":"IF(E48>0,DGET(Vaktperiode0,E$20,$B41:$B42),0)","v":0},{"$f":"IF(F48>0,DGET(Vaktperiode0,F$20,$B41:$B42),0)","v":0}]
[{"$f":"Vaktliste!$A$2","v":1},"Beløp",null,{"$f":"D49*D48","v":0},{"$f":"E49*E48","v":0},{"$f":"F49*F48","v":0},null,{"$f":"SUM(D50:F50)","v":0}]
["X","Vaktperiode",null,"Ordinær"]
[{"$f":"Vaktliste!$A$2","v":1},"3b",null,{"$f":"$C$14","v":"nn6"}]
["X","Vaktperiode",null,null,"Sesong"]
[{"$f":"Vaktliste!$A$2","v":1},{"$f":"B52","v":"3b"},null,null,{"$f":"$C$14","v":"nn6"}]
["X","Vaktperiode",null,null,null,null,"Vakans"]
[{"$f":"Vaktliste!$A$2","v":1},{"$f":"B54","v":"3b"},null,null,null,null,{"$f":"$C$14","v":"nn6"}]
["X",{"$f":"VLOOKUP(B52,Vaktperioder,2,0)","v":"Hellig- og høytidsdag 0600 - 2200"},null,{"$f":"DCOUNTA(Vaktliste,5,$A51:$G52)","v":0},{"$f":"DCOUNTA(Vaktliste,6,$A53:$G54)","v":0},{"$f":"DCOUNTA(Vaktliste,7,$A55:$G56)","v":0}]
[{"$f":"Vaktliste!$A$2","v":1},"Timer",null,{"$f":"D57*DGET(Timer,3,$B51:$B52)","v":0},{"$f":"E57*DGET(Timer,3,$B51:$B52)","v":0},{"$f":"F57*DGET(Timer,3,B51:B52)","v":0}]
["X","Satser",null,{"$f":"IF(D58>0,DGET(Vaktperiode0,D$20,$B51:$B52),0)","v":0},{"$f":"IF(E58>0,DGET(Vaktperiode0,E$20,$B51:$B52),0)","v":0},{"$f":"IF(F58>0,DGET(Vaktperiode0,F$20,$B51:$B52),0)","v":0}]
[{"$f":"Vaktliste!$A$2","v":1},"Beløp",null,{"$f":"D59*D58","v":0},{"$f":"E59*E58","v":0},{"$f":"F59*F58","v":0},null,{"$f":"SUM(D60:F60)","v":0}]
["X","Vaktperiode",null,"Ordinær"]
[{"$f":"Vaktliste!$A$2","v":1},"3c",null,{"$f":"$C$14","v":"nn6"}]
["X","Vaktperiode",null,null,"Sesong"]
[{"$f":"Vaktliste!$A$2","v":1},{"$f":"B62","v":"3c"},null,null,{"$f":"$C$14","v":"nn6"}]
["X","Vaktperiode",null,null,null,null,"Vakans"]
[{"$f":"Vaktliste!$A$2","v":1},{"$f":"B64","v":"3c"},null,null,null,null,{"$f":"$C$14","v":"nn6"}]
["X",{"$f":"VLOOKUP(B62,Vaktperioder,2,0)","v":"Jul- og nyttårsaften 0600 - 1200"},null,{"$f":"DCOUNTA(Vaktliste,5,$A61:$G62)","v":0},{"$f":"DCOUNTA(Vaktliste,6,$A63:$G64)","v":0},{"$f":"DCOUNTA(Vaktliste,7,$A65:$G66)","v":0}]
[{"$f":"Vaktliste!$A$2","v":1},"Timer",null,{"$f":"D67*DGET(Timer,3,$B61:$B62)","v":0},{"$f":"E67*DGET(Timer,3,$B61:$B62)","v":0},{"$f":"F67*DGET(Timer,3,B61:B62)","v":0}]
["X","Satser",null,{"$f":"IF(D68>0,DGET(Vaktperiode0,D$20,$B61:$B62),0)","v":0},{"$f":"IF(E68>0,DGET(Vaktperiode0,E$20,$B61:$B62),0)","v":0},{"$f":"IF(F68>0,DGET(Vaktperiode0,F$20,$B61:$B62),0)","v":0}]
[{"$f":"Vaktliste!$A$2","v":1},"Beløp",null,{"$f":"D69*D68","v":0},{"$f":"E69*E68","v":0},{"$f":"F69*F68","v":0},null,{"$f":"SUM(D70:F70)","v":0}]
["X","Vaktperiode",null,"Ordinær"]
[{"$f":"Vaktliste!$A$2","v":1},"3d",null,{"$f":"$C$14","v":"nn6"}]
["X","Vaktperiode",null,null,"Sesong"]
[{"$f":"Vaktliste!$A$2","v":1},{"$f":"B72","v":"3d"},null,null,{"$f":"$C$14","v":"nn6"}]
["X","Vaktperiode",null,null,null,null,"Vakans"]
[{"$f":"Vaktliste!$A$2","v":1},{"$f":"B74","v":"3d"},null,null,null,null,{"$f":"$C$14","v":"nn6"}]
["X",{"$f":"VLOOKUP(B72,Vaktperioder,2,0)","v":"Påske-, jul- og nyttårsaften 1200 - 2200"},null,{"$f":"DCOUNTA(Vaktliste,5,$A71:$G72)","v":0},{"$f":"DCOUNTA(Vaktliste,6,$A73:$G74)","v":0},{"$f":"DCOUNTA(Vaktliste,7,$A75:$G76)","v":0}]
[{"$f":"Vaktliste!$A$2","v":1},"Timer",null,{"$f":"D77*DGET(Timer,3,$B71:$B72)","v":0},{"$f":"E77*DGET(Timer,3,$B71:$B72)","v":0},{"$f":"F77*DGET(Timer,3,B71:B72)","v":0}]
["X","Satser",null,{"$f":"IF(D78>0,DGET(Vaktperiode0,D$20,$B71:$B72),0)","v":0},{"$f":"IF(E78>0,DGET(Vaktperiode0,E$20,$B71:$B72),0)","v":0},{"$f":"IF(F78>0,DGET(Vaktperiode0,F$20,$B71:$B72),0)","v":0}]
[{"$f":"Vaktliste!$A$2","v":1},"Beløp",null,{"$f":"D79*D78","v":0},{"$f":"E79*E78","v":0},{"$f":"F79*F78","v":0},null,{"$f":"SUM(D80:F80)","v":0}]
["X","Vaktperiode",null,"Ordinær"]
[{"$f":"Vaktliste!$A$2","v":1},"3e",null,{"$f":"$C$14","v":"nn6"}]
["X","Vaktperiode",null,null,"Sesong"]
[{"$f":"Vaktliste!$A$2","v":1},{"$f":"B82","v":"3e"},null,null,{"$f":"$C$14","v":"nn6"}]
["X","Vaktperiode",null,null,null,null,"Vakans"]
[{"$f":"Vaktliste!$A$2","v":1},{"$f":"B84","v":"3e"},null,null,null,null,{"$f":"$C$14","v":"nn6"}]
["X",{"$f":"VLOOKUP(B82,Vaktperioder,2,0)","v":"Påskeaften 0600 - 1200"},null,{"$f":"DCOUNTA(Vaktliste,5,$A81:$G82)","v":0},{"$f":"DCOUNTA(Vaktliste,6,$A83:$G84)","v":0},{"$f":"DCOUNTA(Vaktliste,7,$A85:$G86)","v":0}]
[{"$f":"Vaktliste!$A$2","v":1},"Timer",null,{"$f":"D87*DGET(Timer,3,$B81:$B82)","v":0},{"$f":"E87*DGET(Timer,3,$B81:$B82)","v":0},{"$f":"F87*DGET(Timer,3,B81:B82)","v":0}]
["X","Satser",null,{"$f":"IF(D88>0,DGET(Vaktperiode0,D$20,$B81:$B82),0)","v":0},{"$f":"IF(E88>0,DGET(Vaktperiode0,E$20,$B81:$B82),0)","v":0},{"$f":"IF(F88>0,DGET(Vaktperiode0,F$20,$B81:$B82),0)","v":0}]
[{"$f":"Vaktliste!$A$2","v":1},"Beløp",null,{"$f":"D89*D88","v":0},{"$f":"E89*E88","v":0},{"$f":"F89*F88","v":0},null,{"$f":"SUM(D90:F90)","v":0}]
["X","Vaktperiode",null,"Ordinær"]
[{"$f":"Vaktliste!$A$2","v":1},"4a",null,{"$f":"$C$14","v":"nn6"}]
["X","Vaktperiode",null,null,"Sesong"]
[{"$f":"Vaktliste!$A$2","v":1},{"$f":"B92","v":"4a"},null,null,{"$f":"$C$14","v":"nn6"}]
["X","Vaktperiode",null,null,null,null,"Vakans"]
[{"$f":"Vaktliste!$A$2","v":1},{"$f":"B94","v":"4a"},null,null,null,null,{"$f":"$C$14","v":"nn6"}]
["X",{"$f":"VLOOKUP(B92,Vaktperioder,2,0)","v":"Natt hverdag 2200 - 2400"},null,{"$f":"DCOUNTA(Vaktliste,5,$A91:$G92)","v":0},{"$f":"DCOUNTA(Vaktliste,6,$A93:$G94)","v":0},{"$f":"DCOUNTA(Vaktliste,7,$A95:$G96)","v":0}]
[{"$f":"Vaktliste!$A$2","v":1},"Timer",null,{"$f":"D97*DGET(Timer,3,$B91:$B92)","v":0},{"$f":"E97*DGET(Timer,3,$B91:$B92)","v":0},{"$f":"F97*DGET(Timer,3,B91:B92)","v":0}]
["X","Satser",null,{"$f":"IF(D98>0,DGET(Vaktperiode0,D$20,$B91:$B92),0)","v":0},{"$f":"IF(E98>0,DGET(Vaktperiode0,E$20,$B91:$B92),0)","v":0},{"$f":"IF(F98>0,DGET(Vaktperiode0,F$20,$B91:$B92),0)","v":0}]
[{"$f":"Vaktliste!$A$2","v":1},"Beløp",null,{"$f":"D99*D98","v":0},{"$f":"E99*E98","v":0},{"$f":"F99*F98","v":0},null,{"$f":"SUM(D100:F100)","v":0}]
["X","Vaktperiode",null,"Ordinær"]
[{"$f":"Vaktliste!$A$2","v":1},"4b",null,{"$f":"$C$14","v":"nn6"}]
["X","Vaktperiode",null,null,"Sesong"]
[{"$f":"Vaktliste!$A$2","v":1},{"$f":"B102","v":"4b"},null,null,{"$f":"$C$14","v":"nn6"}]
["X","Vaktperiode",null,null,null,null,"Vakans"]
[{"$f":"Vaktliste!$A$2","v":1},{"$f":"B104","v":"4b"},null,null,null,null,{"$f":"$C$14","v":"nn6"}]
["X",{"$f":"VLOOKUP(B102,Vaktperioder,2,0)","v":"Natt hverdag 0000 - 0600"},null,{"$f":"DCOUNTA(Vaktliste,5,$A101:$G102)","v":0},{"$f":"DCOUNTA(Vaktliste,6,$A103:$G104)","v":0},{"$f":"DCOUNTA(Vaktliste,7,$A105:$G106)","v":0}]
[{"$f":"Vaktliste!$A$2","v":1},"Timer",null,{"$f":"D107*DGET(Timer,3,$B101:$B102)","v":0},{"$f":"E107*DGET(Timer,3,$B101:$B102)","v":0},{"$f":"F107*DGET(Timer,3,B101:B102)","v":0}]
["X","Satser",null,{"$f":"IF(D108>0,DGET(Vaktperiode0,D$20,$B101:$B102),0)","v":0},{"$f":"IF(E108>0,DGET(Vaktperiode0,E$20,$B101:$B102),0)","v":0},{"$f":"IF(F108>0,DGET(Vaktperiode0,F$20,$B101:$B102),0)","v":0}]
[{"$f":"Vaktliste!$A$2","v":1},"Beløp",null,{"$f":"D109*D108","v":0},{"$f":"E109*E108","v":0},{"$f":"F109*F108","v":0},null,{"$f":"SUM(D110:F110)","v":0}]
["X","Vaktperiode",null,"Ordinær"]
[{"$f":"Vaktliste!$A$2","v":1},"4c",null,{"$f":"$C$14","v":"nn6"}]
["X","Vaktperiode",null,null,"Sesong"]
[{"$f":"Vaktliste!$A$2","v":1},{"$f":"B112","v":"4c"},null,null,{"$f":"$C$14","v":"nn6"}]
["X","Vaktperiode",null,null,null,null,"Vakans"]
[{"$f":"Vaktliste!$A$2","v":1},{"$f":"B114","v":"4c"},null,null,null,null,{"$f":"$C$14","v":"nn6"}]
["X",{"$f":"VLOOKUP(B112,Vaktperioder,2,0)","v":"Natt lørdag, søndag 2200 - 2400"},null,{"$f":"DCOUNTA(Vaktliste,5,$A111:$G112)","v":0},{"$f":"DCOUNTA(Vaktliste,6,$A113:$G114)","v":0},{"$f":"DCOUNTA(Vaktliste,7,$A115:$G116)","v":0}]
[{"$f":"Vaktliste!$A$2","v":1},"Timer",null,{"$f":"D117*DGET(Timer,3,$B111:$B112)","v":0},{"$f":"E117*DGET(Timer,3,$B111:$B112)","v":0},{"$f":"F117*DGET(Timer,3,B111:B112)","v":0}]
["X","Satser",null,{"$f":"IF(D118>0,DGET(Vaktperiode0,D$20,$B111:$B112),0)","v":0},{"$f":"IF(E118>0,DGET(Vaktperiode0,E$20,$B111:$B112),0)","v":0},{"$f":"IF(F118>0,DGET(Vaktperiode0,F$20,$B111:$B112),0)","v":0}]
[{"$f":"Vaktliste!$A$2","v":1},"Beløp",null,{"$f":"D119*D118","v":0},{"$f":"E119*E118","v":0},{"$f":"F119*F118","v":0},null,{"$f":"SUM(D120:F120)","v":0}]
["X","Vaktperiode",null,"Ordinær"]
[{"$f":"Vaktliste!$A$2","v":1},"4d",null,{"$f":"$C$14","v":"nn6"}]
["X","Vaktperiode",null,null,"Sesong"]
[{"$f":"Vaktliste!$A$2","v":1},{"$f":"B122","v":"4d"},null,null,{"$f":"$C$14","v":"nn6"}]
["X","Vaktperiode",null,null,null,null,"Vakans"]
[{"$f":"Vaktliste!$A$2","v":1},{"$f":"B124","v":"4d"},null,null,null,null,{"$f":"$C$14","v":"nn6"}]
["X",{"$f":"VLOOKUP(B122,Vaktperioder,2,0)","v":"Natt lørdag, søndag 0000 - 0600"},null,{"$f":"DCOUNTA(Vaktliste,5,$A121:$G122)","v":0},{"$f":"DCOUNTA(Vaktliste,6,$A123:$G124)","v":0},{"$f":"DCOUNTA(Vaktliste,7,$A125:$G126)","v":0}]
[{"$f":"Vaktliste!$A$2","v":1},"Timer",null,{"$f":"D127*DGET(Timer,3,$B121:$B122)","v":0},{"$f":"E127*DGET(Timer,3,$B121:$B122)","v":0},{"$f":"F127*DGET(Timer,3,B121:B122)","v":0}]
["X","Satser",null,{"$f":"IF(D128>0,DGET(Vaktperiode0,D$20,$B121:$B122),0)","v":0},{"$f":"IF(E128>0,DGET(Vaktperiode0,E$20,$B121:$B122),0)","v":0},{"$f":"IF(F128>0,DGET(Vaktperiode0,F$20,$B121:$B122),0)","v":0}]
[{"$f":"Vaktliste!$A$2","v":1},"Beløp",null,{"$f":"D129*D128","v":0},{"$f":"E129*E128","v":0},{"$f":"F129*F128","v":0},null,{"$f":"SUM(D130:F130)","v":0}]
["X","Vaktperiode",null,"Ordinær"]
[{"$f":"Vaktliste!$A$2","v":1},"4e",null,{"$f":"$C$14","v":"nn6"}]
["X","Vaktperiode",null,null,"Sesong"]
[{"$f":"Vaktliste!$A$2","v":1},{"$f":"B132","v":"4e"},null,null,{"$f":"$C$14","v":"nn6"}]
["X","Vaktperiode",null,null,null,null,"Vakans"]
[{"$f":"Vaktliste!$A$2","v":1},{"$f":"B134","v":"4e"},null,null,null,null,{"$f":"$C$14","v":"nn6"}]
["X",{"$f":"VLOOKUP(B132,Vaktperioder,2,0)","v":"Natt hellig- og høytidsdag 2200 - 2400"},null,{"$f":"DCOUNTA(Vaktliste,5,$A131:$G132)","v":0},{"$f":"DCOUNTA(Vaktliste,6,$A133:$G134)","v":0},{"$f":"DCOUNTA(Vaktliste,7,$A135:$G136)","v":0}]
[{"$f":"Vaktliste!$A$2","v":1},"Timer",null,{"$f":"D137*DGET(Timer,3,$B131:$B132)","v":0},{"$f":"E137*DGET(Timer,3,$B131:$B132)","v":0},{"$f":"F137*DGET(Timer,3,B131:B132)","v":0}]
["X","Satser",null,{"$f":"IF(D138>0,DGET(Vaktperiode0,D$20,$B131:$B132),0)","v":0},{"$f":"IF(E138>0,DGET(Vaktperiode0,E$20,$B131:$B132),0)","v":0},{"$f":"IF(F138>0,DGET(Vaktperiode0,F$20,$B131:$B132),0)","v":0}]
[{"$f":"Vaktliste!$A$2","v":1},"Beløp",null,{"$f":"D139*D138","v":0},{"$f":"E139*E138","v":0},{"$f":"F139*F138","v":0},null,{"$f":"SUM(D140:F140)","v":0}]
["X","Vaktperiode",null,"Ordinær"]
[{"$f":"Vaktliste!$A$2","v":1},"4f",null,{"$f":"$C$14","v":"nn6"}]
["X","Vaktperiode",null,null,"Sesong"]
[{"$f":"Vaktliste!$A$2","v":1},{"$f":"B142","v":"4f"},null,null,{"$f":"$C$14","v":"nn6"}]
["X","Vaktperiode",null,null,null,null,"Vakans"]
[{"$f":"Vaktliste!$A$2","v":1},{"$f":"B144","v":"4f"},null,null,null,null,{"$f":"$C$14","v":"nn6"}]
["X",{"$f":"VLOOKUP(B142,Vaktperioder,2,0)","v":"Natt hellig- og høytidsdag 0000 - 0600"},null,{"$f":"DCOUNTA(Vaktliste,5,$A141:$G142)","v":0},{"$f":"DCOUNTA(Vaktliste,6,$A143:$G144)","v":0},{"$f":"DCOUNTA(Vaktliste,7,$A145:$G146)","v":0}]
[{"$f":"Vaktliste!$A$2","v":1},"Timer",null,{"$f":"D147*DGET(Timer,3,$B141:$B142)","v":0},{"$f":"E147*DGET(Timer,3,$B141:$B142)","v":0},{"$f":"F147*DGET(Timer,3,B141:B142)","v":0}]
["X","Satser",null,{"$f":"IF(D148>0,DGET(Vaktperiode0,D$20,$B141:$B142),0)","v":0},{"$f":"IF(E148>0,DGET(Vaktperiode0,E$20,$B141:$B142),0)","v":0},{"$f":"IF(F148>0,DGET(Vaktperiode0,F$20,$B141:$B142),0)","v":0}]
[{"$f":"Vaktliste!$A$2","v":1},"Beløp",null,{"$f":"D149*D148","v":0},{"$f":"E149*E148","v":0},{"$f":"F149*F148","v":0},null,{"$f":"SUM(D150:F150)","v":0}]
[null,"Sum antall vakter / beløp",null,{"$f":"D28+D38+D48+D58+D68+D78+D88+D98+D108+D118+D128+D138+D148","v":0},{"$f":"E28+E38+E48+E58+E68+E78+E88+E98+E108+E118+E128+E138+E148","v":0},{"$f":"F28+F38+F48+F58+F68+F78+F88+F98+F108+F118+F128+F138+F148","v":0},null,{"$f":"SUM(H27:H150)","v":0}]

{"sheet":"nn (7)","index":7,"n_rows":151,"n_cols":8,"rows_kept":151,"cut":false,"hidden":false,"merged":[[150,5,150,6],[148,1,148,2],[148,5,148,6],[149,1,149,2],[149,5,149,6],[139,1,139,2],[139,5,139,6],[146,1,146,2],[146,5,146,6],[147,1,147,2],[127,1,127,2],[127,5,127,6],[128,1,128,2],[128,5,128,6],[129,1,129,2],[129,5,129,6],[147,5,147,6],[136,1,136,2],[136,5,136,6],[137,1,137,2],[137,5,137,6],[138,1,138,2],[138,5,138,6],[11,3,11,4],[3,2,3,6],[5,2,5,6],[9,2,9,4],[7,2,7,6],[126,1,126,2],[126,5,126,6],[27,1,27,2],[27,5,27,6],[28,1,28,2],[29,1,29,2],[29,5,29,6],[36,1,36,2],[36,5,36,6],[28,5,28,6],[16,3,16,6],[17,3,17,6],[19,5,19,6],[26,1,26,2],[26,5,26,6],[47,1,47,2],[47,5,47,6],[48,1,48,2],[48,5,48,6],[39,1,39,2],[39,5,39,6],[46,1,46,2],[46,5,46,6],[37,1,37,2],[37,5,37,6],[38,1,38,2],[38,5,38,6],[59,1,59,2],[59,5,59,6],[66,1,66,2],[66,5,66,6],[57,1,57,2],[57,5,57,6],[58,1,58,2],[58,5,58,6],[49,1,49,2],[49,5,49,6],[56,1,56,2],[56,5,56,6],[77,1,77,2],[77,5,77,6],[78,1,78,2],[78,5,78,6],[69,1,69,2],[69,5,69,6],[76,1,76,2],[76,5,76,6],[67,1,67,2],[67,5,67,6],[68,1,68,2],[68,5,68,6],[89,1,89,2],[89,5,89,6],[96,1,96,2],[96,5,96,6],[87,1,87,2],[87,5,87,6],[88,1,88,2],[88,5,88,6],[79,1,79,2],[79,5,79,6],[86,1,86,2],[86,5,86,6],[12,2,12,6],[119,1,119,2],[119,5,119,6],[13,2,13,3],[117,1,117,2],[117,5,117,6],[118,1,118,2],[118,5,118,6],[109,1,109,2],[109,5,109,6],[116,1,116,2],[116,5,116,6],[107,1,107,2],[107,5,107,6],[108,1,108,2],[108,5,108,6],[99,1,99,2],[99,5,99,6],[106,1,106,2],[106,5,106,6],[97,1,97,2],[97,5,97,6],[98,1,98,2],[98,5,98,6]]}
[null,"REGNING"]
[null,"GODTGJØRING FOR DELTAKELSE I KLINISK VETERINÆRVAKT"]
[]
[null,"Navn:",null,null,null,null,null,"Fakturadato:"]
[null,null,null,null,null,null,null,"Forfallsdato:"]
[null,"Adresse:"]
[]
[null,"Postnummer, -sted:"]
[]
[null,"Bankgirokontonr:"]
[]
[null,"Organisasjonsnummer:","NO",null,null,"MVA"]
[null,"Fullt navn:"]
[null,"Initialer:","nn7"]
[null,"Regningen gjelder vakttjeneste i vaktområdet (jfr. vaktliste):"]
[null,{"$f":"Vaktliste!E1","v":"Primært vaktområde"}]
[null,"for perioden:"]
[null,{"$f":"Vaktliste!B3","v":"2026-01-01"},null,{"$f":"Vaktliste!E4","v":0}]
[]
[null,"Vakttype - antall vakter",null,"Ordinær","Sesong","Vakans",null,"Beløp"]
["X","Vaktperiode",null,"Ordinær"]
[{"$f":"Vaktliste!$A$2","v":1},"1a",null,{"$f":"$C$14","v":"nn7"}]
["X","Vaktperiode",null,null,"Sesong"]
[{"$f":"Vaktliste!$A$2","v":1},{"$f":"B22","v":"1a"},null,null,{"$f":"$C$14","v":"nn7"}]
["X","Vaktperiode",null,null,null,null,"Vakans"]
[{"$f":"Vaktliste!$A$2","v":1},{"$f":"B24","v":"1a"},null,null,null,null,{"$f":"$C$14","v":"nn7"}]
["X",{"$f":"VLOOKUP(B22,Vaktperioder,2,0)","v":"Hverdag, kveld 1600 - 2200"},null,{"$f":"DCOUNTA(Vaktliste,5,$A21:$G22)","v":0},{"$f":"DCOUNTA(Vaktliste,6,$A23:$G24)","v":0},{"$f":"DCOUNTA(Vaktliste,7,$A25:$G26)","v":0}]
[{"$f":"Vaktliste!$A$2","v":1},"Timer",null,{"$f":"D27*DGET(Timer,3,$B21:$B22)","v":0},{"$f":"E27*DGET(Timer,3,$B21:$B22)","v":0},{"$f":"F27*DGET(Timer,3,B21:B22)","v":0}]
["X","Satser",null,{"$f":"IF(D28>0,DGET(Vaktperiode0,D$20,$B21:$B22),0)","v":0},{"$f":"IF(E28>0,DGET(Vaktperiode0,E$20,$B21:$B22),0)","v":0},{"$f":"IF(F28>0,DGET(Vaktperiode0,F$20,$B21:$B22),0)","v":0}]
[{"$f":"Vaktliste!$A$2","v":1},"Beløp",null,{"$f":"D29*D28","v":0},{"$f":"E29*E28","v":0},{"$f":"F29*F28","v":0},null,{"$f":"SUM(D30:F30)","v":0}]
["X","Vaktperiode",null,"Ordinær"]
[{"$f":"Vaktliste!$A$2","v":1},"2a",null,{"$f":"$C$14","v":"nn7"}]
["X","Vaktperiode",null,null,"Sesong"]
[{"$f":"Vaktliste!$A$2","v":1},{"$f":"B32","v":"2a"},null,null,{"$f":"$C$14","v":"nn7"}]
["X","Vaktperiode",null,null,null,null,"Vakans"]
[{"$f":"Vaktliste!$A$2","v":1},{"$f":"B34","v":"2a"},null,null,null,null,{"$f":"$C$14","v":"nn7"}]
["X",{"$f":"VLOOKUP(B32,Vaktperioder,2,0)","v":"Hverdag, morgen 0600 - 0800"},null,{"$f":"DCOUNTA(Vaktliste,5,$A31:$G32)","v":0},{"$f":"DCOUNTA(Vaktliste,6,$A33:$G34)","v":0},{"$f":"DCOUNTA(Vaktliste,7,$A35:$G36)","v":0}]
[{"$f":"Vaktliste!$A$2","v":1},"Timer",null,{"$f":"D37*DGET(Timer,3,$B31:$B32)","v":0},{"$f":"E37*DGET(Timer,3,$B31:$B32)","v":0},{"$f":"F37*DGET(Timer,3,B31:B32)","v":0}]
["X","Satser",null,{"$f":"IF(D38>0,DGET(Vaktperiode0,D$20,$B31:$B32),0)","v":0},{"$f":"IF(E38>0,DGET(Vaktperiode0,E$20,$B31:$B32),0)","v":0},{"$f":"IF(F38>0,DGET(Vaktperiode0,F$20,$B31:$B32),0)","v":0}]
[{"$f":"Vaktliste!$A$2","v":1},"Beløp",null,{"$f":"D39*D38","v":0},{"$f":"E39*E38","v":0},{"$f":"F39*F38","v":0},null,{"$f":"SUM(D40:F40)","v":0}]
["X","Vaktperiode",null,"Ordinær"]
[{"$f":"Vaktliste!$A$2","v":1},"3a",null,{"$f":"$C$14","v":"nn7"}]
["X","Vaktperiode",null,null,"Sesong"]
[{"$f":"Vaktliste!$A$2","v":1},{"$f":"B42","v":"3a"},null,null,{"$f":"$C$14","v":"nn7"}]
["X","Vaktperiode",null,null,null,null,"Vakans"]
[{"$f":"Vaktliste!$A$2","v":1},{"$f":"B44","v":"3a"},null,null,null,null,{"$f":"$C$14","v":"nn7"}]
["X",{"$f":"VLOOKUP(B42,Vaktperioder,2,0)","v":"Lørdag, søndag 0600 - 2200"},null,{"$f":"DCOUNTA(Vaktliste,5,$A41:$G42)","v":0},{"$f":"DCOUNTA(Vaktliste,6,$A43:$G44)","v":0},{"$f":"DCOUNTA(Vaktliste,7,$A45:$G46)","v":0}]
[{"$f":"Vaktliste!$A$2","v":1},"Timer",null,{"$f":"D47*DGET(Timer,3,$B41:$B42)","v":0},{"$f":"E47*DGET(Timer,3,$B41:$B42)","v":0},{"$f":"F47*DGET(Timer,3,B41:B42)","v":0}]
["X","Satser",null,{"$f":"IF(D48>0,DGET(Vaktperiode0,D$20,$B41:$B42),0)","v":0},{"$f":"IF(E48>0,DGET(Vaktperiode0,E$20,$B41:$B42),0)","v":0},{"$f":"IF(F48>0,DGET(Vaktperiode0,F$20,$B41:$B42),0)","v":0}]
[{"$f":"Vaktliste!$A$2","v":1},"Beløp",null,{"$f":"D49*D48","v":0},{"$f":"E49*E48","v":0},{"$f":"F49*F48","v":0},null,{"$f":"SUM(D50:F50)","v":0}]
["X","Vaktperiode",null,"Ordinær"]
[{"$f":"Vaktliste!$A$2","v":1},"3b",null,{"$f":"$C$14","v":"nn7"}]
["X","Vaktperiode",null,null,"Sesong"]
[{"$f":"Vaktliste!$A$2","v":1},{"$f":"B52","v":"3b"},null,null,{"$f":"$C$14","v":"nn7"}]
["X","Vaktperiode",null,null,null,null,"Vakans"]
[{"$f":"Vaktliste!$A$2","v":1},{"$f":"B54","v":"3b"},null,null,null,null,{"$f":"$C$14","v":"nn7"}]
["X",{"$f":"VLOOKUP(B52,Vaktperioder,2,0)","v":"Hellig- og høytidsdag 0600 - 2200"},null,{"$f":"DCOUNTA(Vaktliste,5,$A51:$G52)","v":0},{"$f":"DCOUNTA(Vaktliste,6,$A53:$G54)","v":0},{"$f":"DCOUNTA(Vaktliste,7,$A55:$G56)","v":0}]
[{"$f":"Vaktliste!$A$2","v":1},"Timer",null,{"$f":"D57*DGET(Timer,3,$B51:$B52)","v":0},{"$f":"E57*DGET(Timer,3,$B51:$B52)","v":0},{"$f":"F57*DGET(Timer,3,B51:B52)","v":0}]
["X","Satser",null,{"$f":"IF(D58>0,DGET(Vaktperiode0,D$20,$B51:$B52),0)","v":0},{"$f":"IF(E58>0,DGET(Vaktperiode0,E$20,$B51:$B52),0)","v":0},{"$f":"IF(F58>0,DGET(Vaktperiode0,F$20,$B51:$B52),0)","v":0}]
[{"$f":"Vaktliste!$A$2","v":1},"Beløp",null,{"$f":"D59*D58","v":0},{"$f":"E59*E58","v":0},{"$f":"F59*F58","v":0},null,{"$f":"SUM(D60:F60)","v":0}]
["X","Vaktperiode",null,"Ordinær"]
[{"$f":"Vaktliste!$A$2","v":1},"3c",null,{"$f":"$C$14","v":"nn7"}]
["X","Vaktperiode",null,null,"Sesong"]
[{"$f":"Vaktliste!$A$2","v":1},{"$f":"B62","v":"3c"},null,null,{"$f":"$C$14","v":"nn7"}]
["X","Vaktperiode",null,null,null,null,"Vakans"]
[{"$f":"Vaktliste!$A$2","v":1},{"$f":"B64","v":"3c"},null,null,null,null,{"$f":"$C$14","v":"nn7"}]
["X",{"$f":"VLOOKUP(B62,Vaktperioder,2,0)","v":"Jul- og nyttårsaften 0600 - 1200"},null,{"$f":"DCOUNTA(Vaktliste,5,$A61:$G62)","v":0},{"$f":"DCOUNTA(Vaktliste,6,$A63:$G64)","v":0},{"$f":"DCOUNTA(Vaktliste,7,$A65:$G66)","v":0}]
[{"$f":"Vaktliste!$A$2","v":1},"Timer",null,{"$f":"D67*DGET(Timer,3,$B61:$B62)","v":0},{"$f":"E67*DGET(Timer,3,$B61:$B62)","v":0},{"$f":"F67*DGET(Timer,3,B61:B62)","v":0}]
["X","Satser",null,{"$f":"IF(D68>0,DGET(Vaktperiode0,D$20,$B61:$B62),0)","v":0},{"$f":"IF(E68>0,DGET(Vaktperiode0,E$20,$B61:$B62),0)","v":0},{"$f":"IF(F68>0,DGET(Vaktperiode0,F$20,$B61:$B62),0)","v":0}]
[{"$f":"Vaktliste!$A$2","v":1},"Beløp",null,{"$f":"D69*D68","v":0},{"$f":"E69*E68","v":0},{"$f":"F69*F68","v":0},null,{"$f":"SUM(D70:F70)","v":0}]
["X","Vaktperiode",null,"Ordinær"]
[{"$f":"Vaktliste!$A$2","v":1},"3d",null,{"$f":"$C$14","v":"nn7"}]
["X","Vaktperiode",null,null,"Sesong"]
[{"$f":"Vaktliste!$A$2","v":1},{"$f":"B72","v":"3d"},null,null,{"$f":"$C$14","v":"nn7"}]
["X","Vaktperiode",null,null,null,null,"Vakans"]
[{"$f":"Vaktliste!$A$2","v":1},{"$f":"B74","v":"3d"},null,null,null,null,{"$f":"$C$14","v":"nn7"}]
["X",{"$f":"VLOOKUP(B72,Vaktperioder,2,0)","v":"Påske-, jul- og nyttårsaften 1200 - 2200"},null,{"$f":"DCOUNTA(Vaktliste,5,$A71:$G72)","v":0},{"$f":"DCOUNTA(Vaktliste,6,$A73:$G74)","v":0},{"$f":"DCOUNTA(Vaktliste,7,$A75:$G76)","v":0}]
[{"$f":"Vaktliste!$A$2","v":1},"Timer",null,{"$f":"D77*DGET(Timer,3,$B71:$B72)","v":0},{"$f":"E77*DGET(Timer,3,$B71:$B72)","v":0},{"$f":"F77*DGET(Timer,3,B71:B72)","v":0}]
["X","Satser",null,{"$f":"IF(D78>0,DGET(Vaktperiode0,D$20,$B71:$B72),0)","v":0},{"$f":"IF(E78>0,DGET(Vaktperiode0,E$20,$B71:$B72),0)","v":0},{"$f":"IF(F78>0,DGET(Vaktperiode0,F$20,$B71:$B72),0)","v":0}]
[{"$f":"Vaktliste!$A$2","v":1},"Beløp",null,{"$f":"D79*D78","v":0},{"$f":"E79*E78","v":0},{"$f":"F79*F78","v":0},null,{"$f":"SUM(D80:F80)","v":0}]
["X","Vaktperiode",null,"Ordinær"]
[{"$f":"Vaktliste!$A$2","v":1},"3e",null,{"$f":"$C$14","v":"nn7"}]
["X","Vaktperiode",null,null,"Sesong"]
[{"$f":"Vaktliste!$A$2","v":1},{"$f":"B82","v":"3e"},null,null,{"$f":"$C$14","v":"nn7"}]
["X","Vaktperiode",null,null,null,null,"Vakans"]
[{"$f":"Vaktliste!$A$2","v":1},{"$f":"B84","v":"3e"},null,null,null,null,{"$f":"$C$14","v":"nn7"}]
["X",{"$f":"VLOOKUP(B82,Vaktperioder,2,0)","v":"Påskeaften 0600 - 1200"},null,{"$f":"DCOUNTA(Vaktliste,5,$A81:$G82)","v":0},{"$f":"DCOUNTA(Vaktliste,6,$A83:$G84)","v":0},{"$f":"DCOUNTA(Vaktliste,7,$A85:$G86)","v":0}]
[{"$f":"Vaktliste!$A$2","v":1},"Timer",null,{"$f":"D87*DGET(Timer,3,$B81:$B82)","v":0},{"$f":"E87*DGET(Timer,3,$B81:$B82)","v":0},{"$f":"F87*DGET(Timer,3,B81:B82)","v":0}]
["X","Satser",null,{"$f":"IF(D88>0,DGET(Vaktperiode0,D$20,$B81:$B82),0)","v":0},{"$f":"IF(E88>0,DGET(Vaktperiode0,E$20,$B81:$B82),0)","v":0},{"$f":"IF(F88>0,DGET(Vaktperiode0,F$20,$B81:$B82),0)","v":0}]
[{"$f":"Vaktliste!$A$2","v":1},"Beløp",null,{"$f":"D89*D88","v":0},{"$f":"E89*E88","v":0},{"$f":"F89*F88","v":0},null,{"$f":"SUM(D90:F90)","v":0}]
["X","Vaktperiode",null,"Ordinær"]
[{"$f":"Vaktliste!$A$2","v":1},"4a",null,{"$f":"$C$14","v":"nn7"}]
["X","Vaktperiode",null,null,"Sesong"]
[{"$f":"Vaktliste!$A$2","v":1},{"$f":"B92","v":"4a"},null,null,{"$f":"$C$14","v":"nn7"}]
["X","Vaktperiode",null,null,null,null,"Vakans"]
[{"$f":"Vaktliste!$A$2","v":1},{"$f":"B94","v":"4a"},null,null,null,null,{"$f":"$C$14","v":"nn7"}]
["X",{"$f":"VLOOKUP(B92,Vaktperioder,2,0)","v":"Natt hverdag 2200 - 2400"},null,{"$f":"DCOUNTA(Vaktliste,5,$A91:$G92)","v":0},{"$f":"DCOUNTA(Vaktliste,6,$A93:$G94)","v":0},{"$f":"DCOUNTA(Vaktliste,7,$A95:$G96)","v":0}]
[{"$f":"Vaktliste!$A$2","v":1},"Timer",null,{"$f":"D97*DGET(Timer,3,$B91:$B92)","v":0},{"$f":"E97*DGET(Timer,3,$B91:$B92)","v":0},{"$f":"F97*DGET(Timer,3,B91:B92)","v":0}]
["X","Satser",null,{"$f":"IF(D98>0,DGET(Vaktperiode0,D$20,$B91:$B92),0)","v":0},{"$f":"IF(E98>0,DGET(Vaktperiode0,E$20,$B91:$B92),0)","v":0},{"$f":"IF(F98>0,DGET(Vaktperiode0,F$20,$B91:$B92),0)","v":0}]
[{"$f":"Vaktliste!$A$2","v":1},"Beløp",null,{"$f":"D99*D98","v":0},{"$f":"E99*E98","v":0},{"$f":"F99*F98","v":0},null,{"$f":"SUM(D100:F100)","v":0}]
["X","Vaktperiode",null,"Ordinær"]
[{"$f":"Vaktliste!$A$2","v":1},"4b",null,{"$f":"$C$14","v":"nn7"}]
["X","Vaktperiode",null,null,"Sesong"]
[{"$f":"Vaktliste!$A$2","v":1},{"$f":"B102","v":"4b"},null,null,{"$f":"$C$14","v":"nn7"}]
["X","Vaktperiode",null,null,null,null,"Vakans"]
[{"$f":"Vaktliste!$A$2","v":1},{"$f":"B104","v":"4b"},null,null,null,null,{"$f":"$C$14","v":"nn7"}]
["X",{"$f":"VLOOKUP(B102,Vaktperioder,2,0)","v":"Natt hverdag 0000 - 0600"},null,{"$f":"DCOUNTA(Vaktliste,5,$A101:$G102)","v":0},{"$f":"DCOUNTA(Vaktliste,6,$A103:$G104)","v":0},{"$f":"DCOUNTA(Vaktliste,7,$A105:$G106)","v":0}]
[{"$f":"Vaktliste!$A$2","v":1},"Timer",null,{"$f":"D107*DGET(Timer,3,$B101:$B102)","v":0},{"$f":"E107*DGET(Timer,3,$B101:$B102)","v":0},{"$f":"F107*DGET(Timer,3,B101:B102)","v":0}]
["X","Satser",null,{"$f":"IF(D108>0,DGET(Vaktperiode0,D$20,$B101:$B102),0)","v":0},{"$f":"IF(E108>0,DGET(Vaktperiode0,E$20,$B101:$B102),0)","v":0},{"$f":"IF(F108>0,DGET(Vaktperiode0,F$20,$B101:$B102),0)","v":0}]
[{"$f":"Vaktliste!$A$2","v":1},"Beløp",null,{"$f":"D109*D108","v":0},{"$f":"E109*E108","v":0},{"$f":"F109*F108","v":0},null,{"$f":"SUM(D110:F110)","v":0}]
["X","Vaktperiode",null,"Ordinær"]
[{"$f":"Vaktliste!$A$2","v":1},"4c",null,{"$f":"$C$14","v":"nn7"}]
["X","Vaktperiode",null,null,"Sesong"]
[{"$f":"Vaktliste!$A$2","v":1},{"$f":"B112","v":"4c"},null,null,{"$f":"$C$14","v":"nn7"}]
["X","Vaktperiode",null,null,null,null,"Vakans"]
[{"$f":"Vaktliste!$A$2","v":1},{"$f":"B114","v":"4c"},null,null,null,null,{"$f":"$C$14","v":"nn7"}]
["X",{"$f":"VLOOKUP(B112,Vaktperioder,2,0)","v":"Natt lørdag, søndag 2200 - 2400"},null,{"$f":"DCOUNTA(Vaktliste,5,$A111:$G112)","v":0},{"$f":"DCOUNTA(Vaktliste,6,$A113:$G114)","v":0},{"$f":"DCOUNTA(Vaktliste,7,$A115:$G116)","v":0}]
[{"$f":"Vaktliste!$A$2","v":1},"Timer",null,{"$f":"D117*DGET(Timer,3,$B111:$B112)","v":0},{"$f":"E117*DGET(Timer,3,$B111:$B112)","v":0},{"$f":"F117*DGET(Timer,3,B111:B112)","v":0}]
["X","Satser",null,{"$f":"IF(D118>0,DGET(Vaktperiode0,D$20,$B111:$B112),0)","v":0},{"$f":"IF(E118>0,DGET(Vaktperiode0,E$20,$B111:$B112),0)","v":0},{"$f":"IF(F118>0,DGET(Vaktperiode0,F$20,$B111:$B112),0)","v":0}]
[{"$f":"Vaktliste!$A$2","v":1},"Beløp",null,{"$f":"D119*D118","v":0},{"$f":"E119*E118","v":0},{"$f":"F119*F118","v":0},null,{"$f":"SUM(D120:F120)","v":0}]
["X","Vaktperiode",null,"Ordinær"]
[{"$f":"Vaktliste!$A$2","v":1},"4d",null,{"$f":"$C$14","v":"nn7"}]
["X","Vaktperiode",null,null,"Sesong"]
[{"$f":"Vaktliste!$A$2","v":1},{"$f":"B122","v":"4d"},null,null,{"$f":"$C$14","v":"nn7"}]
["X","Vaktperiode",null,null,null,null,"Vakans"]
[{"$f":"Vaktliste!$A$2","v":1},{"$f":"B124","v":"4d"},null,null,null,null,{"$f":"$C$14","v":"nn7"}]
["X",{"$f":"VLOOKUP(B122,Vaktperioder,2,0)","v":"Natt lørdag, søndag 0000 - 0600"},null,{"$f":"DCOUNTA(Vaktliste,5,$A121:$G122)","v":0},{"$f":"DCOUNTA(Vaktliste,6,$A123:$G124)","v":0},{"$f":"DCOUNTA(Vaktliste,7,$A125:$G126)","v":0}]
[{"$f":"Vaktliste!$A$2","v":1},"Timer",null,{"$f":"D127*DGET(Timer,3,$B121:$B122)","v":0},{"$f":"E127*DGET(Timer,3,$B121:$B122)","v":0},{"$f":"F127*DGET(Timer,3,B121:B122)","v":0}]
["X","Satser",null,{"$f":"IF(D128>0,DGET(Vaktperiode0,D$20,$B121:$B122),0)","v":0},{"$f":"IF(E128>0,DGET(Vaktperiode0,E$20,$B121:$B122),0)","v":0},{"$f":"IF(F128>0,DGET(Vaktperiode0,F$20,$B121:$B122),0)","v":0}]
[{"$f":"Vaktliste!$A$2","v":1},"Beløp",null,{"$f":"D129*D128","v":0},{"$f":"E129*E128","v":0},{"$f":"F129*F128","v":0},null,{"$f":"SUM(D130:F130)","v":0}]
["X","Vaktperiode",null,"Ordinær"]
[{"$f":"Vaktliste!$A$2","v":1},"4e",null,{"$f":"$C$14","v":"nn7"}]
["X","Vaktperiode",null,null,"Sesong"]
[{"$f":"Vaktliste!$A$2","v":1},{"$f":"B132","v":"4e"},null,null,{"$f":"$C$14","v":"nn7"}]
["X","Vaktperiode",null,null,null,null,"Vakans"]
[{"$f":"Vaktliste!$A$2","v":1},{"$f":"B134","v":"4e"},null,null,null,null,{"$f":"$C$14","v":"nn7"}]
["X",{"$f":"VLOOKUP(B132,Vaktperioder,2,0)","v":"Natt hellig- og høytidsdag 2200 - 2400"},null,{"$f":"DCOUNTA(Vaktliste,5,$A131:$G132)","v":0},{"$f":"DCOUNTA(Vaktliste,6,$A133:$G134)","v":0},{"$f":"DCOUNTA(Vaktliste,7,$A135:$G136)","v":0}]
[{"$f":"Vaktliste!$A$2","v":1},"Timer",null,{"$f":"D137*DGET(Timer,3,$B131:$B132)","v":0},{"$f":"E137*DGET(Timer,3,$B131:$B132)","v":0},{"$f":"F137*DGET(Timer,3,B131:B132)","v":0}]
["X","Satser",null,{"$f":"IF(D138>0,DGET(Vaktperiode0,D$20,$B131:$B132),0)","v":0},{"$f":"IF(E138>0,DGET(Vaktperiode0,E$20,$B131:$B132),0)","v":0},{"$f":"IF(F138>0,DGET(Vaktperiode0,F$20,$B131:$B132),0)","v":0}]
[{"$f":"Vaktliste!$A$2","v":1},"Beløp",null,{"$f":"D139*D138","v":0},{"$f":"E139*E138","v":0},{"$f":"F139*F138","v":0},null,{"$f":"SUM(D140:F140)","v":0}]
["X","Vaktperiode",null,"Ordinær"]
[{"$f":"Vaktliste!$A$2","v":1},"4f",null,{"$f":"$C$14","v":"nn7"}]
["X","Vaktperiode",null,null,"Sesong"]
[{"$f":"Vaktliste!$A$2","v":1},{"$f":"B142","v":"4f"},null,null,{"$f":"$C$14","v":"nn7"}]
["X","Vaktperiode",null,null,null,null,"Vakans"]
[{"$f":"Vaktliste!$A$2","v":1},{"$f":"B144","v":"4f"},null,null,null,null,{"$f":"$C$14","v":"nn7"}]
["X",{"$f":"VLOOKUP(B142,Vaktperioder,2,0)","v":"Natt hellig- og høytidsdag 0000 - 0600"},null,{"$f":"DCOUNTA(Vaktliste,5,$A141:$G142)","v":0},{"$f":"DCOUNTA(Vaktliste,6,$A143:$G144)","v":0},{"$f":"DCOUNTA(Vaktliste,7,$A145:$G146)","v":0}]
[{"$f":"Vaktliste!$A$2","v":1},"Timer",null,{"$f":"D147*DGET(Timer,3,$B141:$B142)","v":0},{"$f":"E147*DGET(Timer,3,$B141:$B142)","v":0},{"$f":"F147*DGET(Timer,3,B141:B142)","v":0}]
["X","Satser",null,{"$f":"IF(D148>0,DGET(Vaktperiode0,D$20,$B141:$B142),0)","v":0},{"$f":"IF(E148>0,DGET(Vaktperiode0,E$20,$B141:$B142),0)","v":0},{"$f":"IF(F148>0,DGET(Vaktperiode0,F$20,$B141:$B142),0)","v":0}]
[{"$f":"Vaktliste!$A$2","v":1},"Beløp",null,{"$f":"D149*D148","v":0},{"$f":"E149*E148","v":0},{"$f":"F149*F148","v":0},null,{"$f":"SUM(D150:F150)","v":0}]
[null,"Sum antall vakter / beløp",null,{"$f":"D28+D38+D48+D58+D68+D78+D88+D98+D108+D118+D128+D138+D148","v":0},{"$f":"E28+E38+E48+E58+E68+E78+E88+E98+E108+E118+E128+E138+E148","v":0},{"$f":"F28+F38+F48+F58+F68+F78+F88+F98+F108+F118+F128+F138+F148","v":0},null,{"$f":"SUM(H27:H150)","v":0}]

{"sheet":"nn (8)","index":8,"n_rows":151,"n_cols":8,"rows_kept":151,"cut":false,"hidden":false,"merged":[[150,5,150,6],[148,1,148,2],[148,5,148,6],[149,1,149,2],[149,5,149,6],[139,1,139,2],[139,5,139,6],[146,1,146,2],[146,5,146,6],[147,1,147,2],[127,1,127,2],[127,5,127,6],[128,1,128,2],[128,5,128,6],[129,1,129,2],[129,5,129,6],[147,5,147,6],[136,1,136,2],[136,5,136,6],[137,1,137,2],[137,5,137,6],[138,1,138,2],[138,5,138,6],[11,3,11,4],[3,2,3,6],[5,2,5,6],[9,2,9,4],[7,2,7,6],[126,1,126,2],[126,5,126,6],[27,1,27,2],[27,5,27,6],[28,1,28,2],[29,1,29,2],[29,5,29,6],[36,1,36,2],[36,5,36,6],[28,5,28,6],[16,3,16,6],[17,3,17,6],[19,5,19,6],[26,1,26,2],[26,5,26,6],[47,1,47,2],[47,5,47,6],[48,1,48,2],[48,5,48,6],[39,1,39,2],[39,5,39,6],[46,1,46,2],[46,5,46,6],[37,1,37,2],[37,5,37,6],[38,1,38,2],[38,5,38,6],[59,1,59,2],[59,5,59,6],[66,1,66,2],[66,5,66,6],[57,1,57,2],[57,5,57,6],[58,1,58,2],[58,5,58,6],[49,1,49,2],[49,5,49,6],[56,1,56,2],[56,5,56,6],[77,1,77,2],[77,5,77,6],[78,1,78,2],[78,5,78,6],[69,1,69,2],[69,5,69,6],[76,1,76,2],[76,5,76,6],[67,1,67,2],[67,5,67,6],[68,1,68,2],[68,5,68,6],[89,1,89,2],[89,5,89,6],[96,1,96,2],[96,5,96,6],[87,1,87,2],[87,5,87,6],[88,1,88,2],[88,5,88,6],[79,1,79,2],[79,5,79,6],[86,1,86,2],[86,5,86,6],[12,2,12,6],[119,1,119,2],[119,5,119,6],[13,2,13,3],[117,1,117,2],[117,5,117,6],[118,1,118,2],[118,5,118,6],[109,1,109,2],[109,5,109,6],[116,1,116,2],[116,5,116,6],[107,1,107,2],[107,5,107,6],[108,1,108,2],[108,5,108,6],[99,1,99,2],[99,5,99,6],[106,1,106,2],[106,5,106,6],[97,1,97,2],[97,5,97,6],[98,1,98,2],[98,5,98,6]]}
[null,"REGNING"]
[null,"GODTGJØRING FOR DELTAKELSE I KLINISK VETERINÆRVAKT"]
[]
[null,"Navn:",null,null,null,null,null,"Fakturadato:"]
[null,null,null,null,null,null,null,"Forfallsdato:"]
[null,"Adresse:"]
[]
[null,"Postnummer, -sted:"]
[]
[null,"Bankgirokontonr:"]
[]
[null,"Organisasjonsnummer:","NO",null,null,"MVA"]
[null,"Fullt navn:"]
[null,"Initialer:","nn8"]
[null,"Regningen gjelder vakttjeneste i vaktområdet (jfr. vaktliste):"]
[null,{"$f":"Vaktliste!E1","v":"Primært vaktområde"}]
[null,"for perioden:"]
[null,{"$f":"Vaktliste!B3","v":"2026-01-01"},null,{"$f":"Vaktliste!E4","v":0}]
[]
[null,"Vakttype - antall vakter",null,"Ordinær","Sesong","Vakans",null,"Beløp"]
["X","Vaktperiode",null,"Ordinær"]
[{"$f":"Vaktliste!$A$2","v":1},"1a",null,{"$f":"$C$14","v":"nn8"}]
["X","Vaktperiode",null,null,"Sesong"]
[{"$f":"Vaktliste!$A$2","v":1},{"$f":"B22","v":"1a"},null,null,{"$f":"$C$14","v":"nn8"}]
["X","Vaktperiode",null,null,null,null,"Vakans"]
[{"$f":"Vaktliste!$A$2","v":1},{"$f":"B24","v":"1a"},null,null,null,null,{"$f":"$C$14","v":"nn8"}]
["X",{"$f":"VLOOKUP(B22,Vaktperioder,2,0)","v":"Hverdag, kveld 1600 - 2200"},null,{"$f":"DCOUNTA(Vaktliste,5,$A21:$G22)","v":0},{"$f":"DCOUNTA(Vaktliste,6,$A23:$G24)","v":0},{"$f":"DCOUNTA(Vaktliste,7,$A25:$G26)","v":0}]
[{"$f":"Vaktliste!$A$2","v":1},"Timer",null,{"$f":"D27*DGET(Timer,3,$B21:$B22)","v":0},{"$f":"E27*DGET(Timer,3,$B21:$B22)","v":0},{"$f":"F27*DGET(Timer,3,B21:B22)","v":0}]
["X","Satser",null,{"$f":"IF(D28>0,DGET(Vaktperiode0,D$20,$B21:$B22),0)","v":0},{"$f":"IF(E28>0,DGET(Vaktperiode0,E$20,$B21:$B22),0)","v":0},{"$f":"IF(F28>0,DGET(Vaktperiode0,F$20,$B21:$B22),0)","v":0}]
[{"$f":"Vaktliste!$A$2","v":1},"Beløp",null,{"$f":"D29*D28","v":0},{"$f":"E29*E28","v":0},{"$f":"F29*F28","v":0},null,{"$f":"SUM(D30:F30)","v":0}]
["X","Vaktperiode",null,"Ordinær"]
[{"$f":"Vaktliste!$A$2","v":1},"2a",null,{"$f":"$C$14","v":"nn8"}]
["X","Vaktperiode",null,null,"Sesong"]
[{"$f":"Vaktliste!$A$2","v":1},{"$f":"B32","v":"2a"},null,null,{"$f":"$C$14","v":"nn8"}]
["X","Vaktperiode",null,null,null,null,"Vakans"]
[{"$f":"Vaktliste!$A$2","v":1},{"$f":"B34","v":"2a"},null,null,null,null,{"$f":"$C$14","v":"nn8"}]
["X",{"$f":"VLOOKUP(B32,Vaktperioder,2,0)","v":"Hverdag, morgen 0600 - 0800"},null,{"$f":"DCOUNTA(Vaktliste,5,$A31:$G32)","v":0},{"$f":"DCOUNTA(Vaktliste,6,$A33:$G34)","v":0},{"$f":"DCOUNTA(Vaktliste,7,$A35:$G36)","v":0}]
[{"$f":"Vaktliste!$A$2","v":1},"Timer",null,{"$f":"D37*DGET(Timer,3,$B31:$B32)","v":0},{"$f":"E37*DGET(Timer,3,$B31:$B32)","v":0},{"$f":"F37*DGET(Timer,3,B31:B32)","v":0}]
["X","Satser",null,{"$f":"IF(D38>0,DGET(Vaktperiode0,D$20,$B31:$B32),0)","v":0},{"$f":"IF(E38>0,DGET(Vaktperiode0,E$20,$B31:$B32),0)","v":0},{"$f":"IF(F38>0,DGET(Vaktperiode0,F$20,$B31:$B32),0)","v":0}]
[{"$f":"Vaktliste!$A$2","v":1},"Beløp",null,{"$f":"D39*D38","v":0},{"$f":"E39*E38","v":0},{"$f":"F39*F38","v":0},null,{"$f":"SUM(D40:F40)","v":0}]
["X","Vaktperiode",null,"Ordinær"]
[{"$f":"Vaktliste!$A$2","v":1},"3a",null,{"$f":"$C$14","v":"nn8"}]
["X","Vaktperiode",null,null,"Sesong"]
[{"$f":"Vaktliste!$A$2","v":1},{"$f":"B42","v":"3a"},null,null,{"$f":"$C$14","v":"nn8"}]
["X","Vaktperiode",null,null,null,null,"Vakans"]
[{"$f":"Vaktliste!$A$2","v":1},{"$f":"B44","v":"3a"},null,null,null,null,{"$f":"$C$14","v":"nn8"}]
["X",{"$f":"VLOOKUP(B42,Vaktperioder,2,0)","v":"Lørdag, søndag 0600 - 2200"},null,{"$f":"DCOUNTA(Vaktliste,5,$A41:$G42)","v":0},{"$f":"DCOUNTA(Vaktliste,6,$A43:$G44)","v":0},{"$f":"DCOUNTA(Vaktliste,7,$A45:$G46)","v":0}]
[{"$f":"Vaktliste!$A$2","v":1},"Timer",null,{"$f":"D47*DGET(Timer,3,$B41:$B42)","v":0},{"$f":"E47*DGET(Timer,3,$B41:$B42)","v":0},{"$f":"F47*DGET(Timer,3,B41:B42)","v":0}]
["X","Satser",null,{"$f":"IF(D48>0,DGET(Vaktperiode0,D$20,$B41:$B42),0)","v":0},{"$f":"IF(E48>0,DGET(Vaktperiode0,E$20,$B41:$B42),0)","v":0},{"$f":"IF(F48>0,DGET(Vaktperiode0,F$20,$B41:$B42),0)","v":0}]
[{"$f":"Vaktliste!$A$2","v":1},"Beløp",null,{"$f":"D49*D48","v":0},{"$f":"E49*E48","v":0},{"$f":"F49*F48","v":0},null,{"$f":"SUM(D50:F50)","v":0}]
["X","Vaktperiode",null,"Ordinær"]
[{"$f":"Vaktliste!$A$2","v":1},"3b",null,{"$f":"$C$14","v":"nn8"}]
["X","Vaktperiode",null,null,"Sesong"]
[{"$f":"Vaktliste!$A$2","v":1},{"$f":"B52","v":"3b"},null,null,{"$f":"$C$14","v":"nn8"}]
["X","Vaktperiode",null,null,null,null,"Vakans"]
[{"$f":"Vaktliste!$A$2","v":1},{"$f":"B54","v":"3b"},null,null,null,null,{"$f":"$C$14","v":"nn8"}]
["X",{"$f":"VLOOKUP(B52,Vaktperioder,2,0)","v":"Hellig- og høytidsdag 0600 - 2200"},null,{"$f":"DCOUNTA(Vaktliste,5,$A51:$G52)","v":0},{"$f":"DCOUNTA(Vaktliste,6,$A53:$G54)","v":0},{"$f":"DCOUNTA(Vaktliste,7,$A55:$G56)","v":0}]
[{"$f":"Vaktliste!$A$2","v":1},"Timer",null,{"$f":"D57*DGET(Timer,3,$B51:$B52)","v":0},{"$f":"E57*DGET(Timer,3,$B51:$B52)","v":0},{"$f":"F57*DGET(Timer,3,B51:B52)","v":0}]
["X","Satser",null,{"$f":"IF(D58>0,DGET(Vaktperiode0,D$20,$B51:$B52),0)","v":0},{"$f":"IF(E58>0,DGET(Vaktperiode0,E$20,$B51:$B52),0)","v":0},{"$f":"IF(F58>0,DGET(Vaktperiode0,F$20,$B51:$B52),0)","v":0}]
[{"$f":"Vaktliste!$A$2","v":1},"Beløp",null,{"$f":"D59*D58","v":0},{"$f":"E59*E58","v":0},{"$f":"F59*F58","v":0},null,{"$f":"SUM(D60:F60)","v":0}]
["X","Vaktperiode",null,"Ordinær"]
[{"$f":"Vaktliste!$A$2","v":1},"3c",null,{"$f":"$C$14","v":"nn8"}]
["X","Vaktperiode",null,null,"Sesong"]
[{"$f":"Vaktliste!$A$2","v":1},{"$f":"B62","v":"3c"},null,null,{"$f":"$C$14","v":"nn8"}]
["X","Vaktperiode",null,null,null,null,"Vakans"]
[{"$f":"Vaktliste!$A$2","v":1},{"$f":"B64","v":"3c"},null,null,null,null,{"$f":"$C$14","v":"nn8"}]
["X",{"$f":"VLOOKUP(B62,Vaktperioder,2,0)","v":"Jul- og nyttårsaften 0600 - 1200"},null,{"$f":"DCOUNTA(Vaktliste,5,$A61:$G62)","v":0},{"$f":"DCOUNTA(Vaktliste,6,$A63:$G64)","v":0},{"$f":"DCOUNTA(Vaktliste,7,$A65:$G66)","v":0}]
[{"$f":"Vaktliste!$A$2","v":1},"Timer",null,{"$f":"D67*DGET(Timer,3,$B61:$B62)","v":0},{"$f":"E67*DGET(Timer,3,$B61:$B62)","v":0},{"$f":"F67*DGET(Timer,3,B61:B62)","v":0}]
["X","Satser",null,{"$f":"IF(D68>0,DGET(Vaktperiode0,D$20,$B61:$B62),0)","v":0},{"$f":"IF(E68>0,DGET(Vaktperiode0,E$20,$B61:$B62),0)","v":0},{"$f":"IF(F68>0,DGET(Vaktperiode0,F$20,$B61:$B62),0)","v":0}]
[{"$f":"Vaktliste!$A$2","v":1},"Beløp",null,{"$f":"D69*D68","v":0},{"$f":"E69*E68","v":0},{"$f":"F69*F68","v":0},null,{"$f":"SUM(D70:F70)","v":0}]
["X","Vaktperiode",null,"Ordinær"]
[{"$f":"Vaktliste!$A$2","v":1},"3d",null,{"$f":"$C$14","v":"nn8"}]
["X","Vaktperiode",null,null,"Sesong"]
[{"$f":"Vaktliste!$A$2","v":1},{"$f":"B72","v":"3d"},null,null,{"$f":"$C$14","v":"nn8"}]
["X","Vaktperiode",null,null,null,null,"Vakans"]
[{"$f":"Vaktliste!$A$2","v":1},{"$f":"B74","v":"3d"},null,null,null,null,{"$f":"$C$14","v":"nn8"}]
["X",{"$f":"VLOOKUP(B72,Vaktperioder,2,0)","v":"Påske-, jul- og nyttårsaften 1200 - 2200"},null,{"$f":"DCOUNTA(Vaktliste,5,$A71:$G72)","v":0},{"$f":"DCOUNTA(Vaktliste,6,$A73:$G74)","v":0},{"$f":"DCOUNTA(Vaktliste,7,$A75:$G76)","v":0}]
[{"$f":"Vaktliste!$A$2","v":1},"Timer",null,{"$f":"D77*DGET(Timer,3,$B71:$B72)","v":0},{"$f":"E77*DGET(Timer,3,$B71:$B72)","v":0},{"$f":"F77*DGET(Timer,3,B71:B72)","v":0}]
["X","Satser",null,{"$f":"IF(D78>0,DGET(Vaktperiode0,D$20,$B71:$B72),0)","v":0},{"$f":"IF(E78>0,DGET(Vaktperiode0,E$20,$B71:$B72),0)","v":0},{"$f":"IF(F78>0,DGET(Vaktperiode0,F$20,$B71:$B72),0)","v":0}]
[{"$f":"Vaktliste!$A$2","v":1},"Beløp",null,{"$f":"D79*D78","v":0},{"$f":"E79*E78","v":0},{"$f":"F79*F78","v":0},null,{"$f":"SUM(D80:F80)","v":0}]
["X","Vaktperiode",null,"Ordinær"]
[{"$f":"Vaktliste!$A$2","v":1},"3e",null,{"$f":"$C$14","v":"nn8"}]
["X","Vaktperiode",null,null,"Sesong"]
[{"$f":"Vaktliste!$A$2","v":1},{"$f":"B82","v":"3e"},null,null,{"$f":"$C$14","v":"nn8"}]
["X","Vaktperiode",null,null,null,null,"Vakans"]
[{"$f":"Vaktliste!$A$2","v":1},{"$f":"B84","v":"3e"},null,null,null,null,{"$f":"$C$14","v":"nn8"}]
["X",{"$f":"VLOOKUP(B82,Vaktperioder,2,0)","v":"Påskeaften 0600 - 1200"},null,{"$f":"DCOUNTA(Vaktliste,5,$A81:$G82)","v":0},{"$f":"DCOUNTA(Vaktliste,6,$A83:$G84)","v":0},{"$f":"DCOUNTA(Vaktliste,7,$A85:$G86)","v":0}]
[{"$f":"Vaktliste!$A$2","v":1},"Timer",null,{"$f":"D87*DGET(Timer,3,$B81:$B82)","v":0},{"$f":"E87*DGET(Timer,3,$B81:$B82)","v":0},{"$f":"F87*DGET(Timer,3,B81:B82)","v":0}]
["X","Satser",null,{"$f":"IF(D88>0,DGET(Vaktperiode0,D$20,$B81:$B82),0)","v":0},{"$f":"IF(E88>0,DGET(Vaktperiode0,E$20,$B81:$B82),0)","v":0},{"$f":"IF(F88>0,DGET(Vaktperiode0,F$20,$B81:$B82),0)","v":0}]
[{"$f":"Vaktliste!$A$2","v":1},"Beløp",null,{"$f":"D89*D88","v":0},{"$f":"E89*E88","v":0},{"$f":"F89*F88","v":0},null,{"$f":"SUM(D90:F90)","v":0}]
["X","Vaktperiode",null,"Ordinær"]
[{"$f":"Vaktliste!$A$2","v":1},"4a",null,{"$f":"$C$14","v":"nn8"}]
["X","Vaktperiode",null,null,"Sesong"]
[{"$f":"Vaktliste!$A$2","v":1},{"$f":"B92","v":"4a"},null,null,{"$f":"$C$14","v":"nn8"}]
["X","Vaktperiode",null,null,null,null,"Vakans"]
[{"$f":"Vaktliste!$A$2","v":1},{"$f":"B94","v":"4a"},null,null,null,null,{"$f":"$C$14","v":"nn8"}]
["X",{"$f":"VLOOKUP(B92,Vaktperioder,2,0)","v":"Natt hverdag 2200 - 2400"},null,{"$f":"DCOUNTA(Vaktliste,5,$A91:$G92)","v":0},{"$f":"DCOUNTA(Vaktliste,6,$A93:$G94)","v":0},{"$f":"DCOUNTA(Vaktliste,7,$A95:$G96)","v":0}]
[{"$f":"Vaktliste!$A$2","v":1},"Timer",null,{"$f":"D97*DGET(Timer,3,$B91:$B92)","v":0},{"$f":"E97*DGET(Timer,3,$B91:$B92)","v":0},{"$f":"F97*DGET(Timer,3,B91:B92)","v":0}]
["X","Satser",null,{"$f":"IF(D98>0,DGET(Vaktperiode0,D$20,$B91:$B92),0)","v":0},{"$f":"IF(E98>0,DGET(Vaktperiode0,E$20,$B91:$B92),0)","v":0},{"$f":"IF(F98>0,DGET(Vaktperiode0,F$20,$B91:$B92),0)","v":0}]
[{"$f":"Vaktliste!$A$2","v":1},"Beløp",null,{"$f":"D99*D98","v":0},{"$f":"E99*E98","v":0},{"$f":"F99*F98","v":0},null,{"$f":"SUM(D100:F100)","v":0}]
["X","Vaktperiode",null,"Ordinær"]
[{"$f":"Vaktliste!$A$2","v":1},"4b",null,{"$f":"$C$14","v":"nn8"}]
["X","Vaktperiode",null,null,"Sesong"]
[{"$f":"Vaktliste!$A$2","v":1},{"$f":"B102","v":"4b"},null,null,{"$f":"$C$14","v":"nn8"}]
["X","Vaktperiode",null,null,null,null,"Vakans"]
[{"$f":"Vaktliste!$A$2","v":1},{"$f":"B104","v":"4b"},null,null,null,null,{"$f":"$C$14","v":"nn8"}]
["X",{"$f":"VLOOKUP(B102,Vaktperioder,2,0)","v":"Natt hverdag 0000 - 0600"},null,{"$f":"DCOUNTA(Vaktliste,5,$A101:$G102)","v":0},{"$f":"DCOUNTA(Vaktliste,6,$A103:$G104)","v":0},{"$f":"DCOUNTA(Vaktliste,7,$A105:$G106)","v":0}]
[{"$f":"Vaktliste!$A$2","v":1},"Timer",null,{"$f":"D107*DGET(Timer,3,$B101:$B102)","v":0},{"$f":"E107*DGET(Timer,3,$B101:$B102)","v":0},{"$f":"F107*DGET(Timer,3,B101:B102)","v":0}]
["X","Satser",null,{"$f":"IF(D108>0,DGET(Vaktperiode0,D$20,$B101:$B102),0)","v":0},{"$f":"IF(E108>0,DGET(Vaktperiode0,E$20,$B101:$B102),0)","v":0},{"$f":"IF(F108>0,DGET(Vaktperiode0,F$20,$B101:$B102),0)","v":0}]
[{"$f":"Vaktliste!$A$2","v":1},"Beløp",null,{"$f":"D109*D108","v":0},{"$f":"E109*E108","v":0},{"$f":"F109*F108","v":0},null,{"$f":"SUM(D110:F110)","v":0}]
["X","Vaktperiode",null,"Ordinær"]
[{"$f":"Vaktliste!$A$2","v":1},"4c",null,{"$f":"$C$14","v":"nn8"}]
["X","Vaktperiode",null,null,"Sesong"]
[{"$f":"Vaktliste!$A$2","v":1},{"$f":"B112","v":"4c"},null,null,{"$f":"$C$14","v":"nn8"}]
["X","Vaktperiode",null,null,null,null,"Vakans"]
[{"$f":"Vaktliste!$A$2","v":1},{"$f":"B114","v":"4c"},null,null,null,null,{"$f":"$C$14","v":"nn8"}]
["X",{"$f":"VLOOKUP(B112,Vaktperioder,2,0)","v":"Natt lørdag, søndag 2200 - 2400"},null,{"$f":"DCOUNTA(Vaktliste,5,$A111:$G112)","v":0},{"$f":"DCOUNTA(Vaktliste,6,$A113:$G114)","v":0},{"$f":"DCOUNTA(Vaktliste,7,$A115:$G116)","v":0}]
[{"$f":"Vaktliste!$A$2","v":1},"Timer",null,{"$f":"D117*DGET(Timer,3,$B111:$B112)","v":0},{"$f":"E117*DGET(Timer,3,$B111:$B112)","v":0},{"$f":"F117*DGET(Timer,3,B111:B112)","v":0}]
["X","Satser",null,{"$f":"IF(D118>0,DGET(Vaktperiode0,D$20,$B111:$B112),0)","v":0},{"$f":"IF(E118>0,DGET(Vaktperiode0,E$20,$B111:$B112),0)","v":0},{"$f":"IF(F118>0,DGET(Vaktperiode0,F$20,$B111:$B112),0)","v":0}]
[{"$f":"Vaktliste!$A$2","v":1},"Beløp",null,{"$f":"D119*D118","v":0},{"$f":"E119*E118","v":0},{"$f":"F119*F118","v":0},null,{"$f":"SUM(D120:F120)","v":0}]
["X","Vaktperiode",null,"Ordinær"]
[{"$f":"Vaktliste!$A$2","v":1},"4d",null,{"$f":"$C$14","v":"nn8"}]
["X","Vaktperiode",null,null,"Sesong"]
[{"$f":"Vaktliste!$A$2","v":1},{"$f":"B122","v":"4d"},null,null,{"$f":"$C$14","v":"nn8"}]
["X","Vaktperiode",null,null,null,null,"Vakans"]
[{"$f":"Vaktliste!$A$2","v":1},{"$f":"B124","v":"4d"},null,null,null,null,{"$f":"$C$14","v":"nn8"}]
["X",{"$f":"VLOOKUP(B122,Vaktperioder,2,0)","v":"Natt lørdag, søndag 0000 - 0600"},null,{"$f":"DCOUNTA(Vaktliste,5,$A121:$G122)","v":0},{"$f":"DCOUNTA(Vaktliste,6,$A123:$G124)","v":0},{"$f":"DCOUNTA(Vaktliste,7,$A125:$G126)","v":0}]
[{"$f":"Vaktliste!$A$2","v":1},"Timer",null,{"$f":"D127*DGET(Timer,3,$B121:$B122)","v":0},{"$f":"E127*DGET(Timer,3,$B121:$B122)","v":0},{"$f":"F127*DGET(Timer,3,B121:B122)","v":0}]
["X","Satser",null,{"$f":"IF(D128>0,DGET(Vaktperiode0,D$20,$B121:$B122),0)","v":0},{"$f":"IF(E128>0,DGET(Vaktperiode0,E$20,$B121:$B122),0)","v":0},{"$f":"IF(F128>0,DGET(Vaktperiode0,F$20,$B121:$B122),0)","v":0}]
[{"$f":"Vaktliste!$A$2","v":1},"Beløp",null,{"$f":"D129*D128","v":0},{"$f":"E129*E128","v":0},{"$f":"F129*F128","v":0},null,{"$f":"SUM(D130:F130)","v":0}]
["X","Vaktperiode",null,"Ordinær"]
[{"$f":"Vaktliste!$A$2","v":1},"4e",null,{"$f":"$C$14","v":"nn8"}]
["X","Vaktperiode",null,null,"Sesong"]
[{"$f":"Vaktliste!$A$2","v":1},{"$f":"B132","v":"4e"},null,null,{"$f":"$C$14","v":"nn8"}]
["X","Vaktperiode",null,null,null,null,"Vakans"]
[{"$f":"Vaktliste!$A$2","v":1},{"$f":"B134","v":"4e"},null,null,null,null,{"$f":"$C$14","v":"nn8"}]
["X",{"$f":"VLOOKUP(B132,Vaktperioder,2,0)","v":"Natt hellig- og høytidsdag 2200 - 2400"},null,{"$f":"DCOUNTA(Vaktliste,5,$A131:$G132)","v":0},{"$f":"DCOUNTA(Vaktliste,6,$A133:$G134)","v":0},{"$f":"DCOUNTA(Vaktliste,7,$A135:$G136)","v":0}]
[{"$f":"Vaktliste!$A$2","v":1},"Timer",null,{"$f":"D137*DGET(Timer,3,$B131:$B132)","v":0},{"$f":"E137*DGET(Timer,3,$B131:$B132)","v":0},{"$f":"F137*DGET(Timer,3,B131:B132)","v":0}]
["X","Satser",null,{"$f":"IF(D138>0,DGET(Vaktperiode0,D$20,$B131:$B132),0)","v":0},{"$f":"IF(E138>0,DGET(Vaktperiode0,E$20,$B131:$B132),0)","v":0},{"$f":"IF(F138>0,DGET(Vaktperiode0,F$20,$B131:$B132),0)","v":0}]
[{"$f":"Vaktliste!$A$2","v":1},"Beløp",null,{"$f":"D139*D138","v":0},{"$f":"E139*E138","v":0},{"$f":"F139*F138","v":0},null,{"$f":"SUM(D140:F140)","v":0}]
["X","Vaktperiode",null,"Ordinær"]
[{"$f":"Vaktliste!$A$2","v":1},"4f",null,{"$f":"$C$14","v":"nn8"}]
["X","Vaktperiode",null,null,"Sesong"]
[{"$f":"Vaktliste!$A$2","v":1},{"$f":"B142","v":"4f"},null,null,{"$f":"$C$14","v":"nn8"}]
["X","Vaktperiode",null,null,null,null,"Vakans"]
[{"$f":"Vaktliste!$A$2","v":1},{"$f":"B144","v":"4f"},null,null,null,null,{"$f":"$C$14","v":"nn8"}]
["X",{"$f":"VLOOKUP(B142,Vaktperioder,2,0)","v":"Natt hellig- og høytidsdag 0000 - 0600"},null,{"$f":"DCOUNTA(Vaktliste,5,$A141:$G142)","v":0},{"$f":"DCOUNTA(Vaktliste,6,$A143:$G144)","v":0},{"$f":"DCOUNTA(Vaktliste,7,$A145:$G146)","v":0}]
[{"$f":"Vaktliste!$A$2","v":1},"Timer",null,{"$f":"D147*DGET(Timer,3,$B141:$B142)","v":0},{"$f":"E147*DGET(Timer,3,$B141:$B142)","v":0},{"$f":"F147*DGET(Timer,3,B141:B142)","v":0}]
["X","Satser",null,{"$f":"IF(D148>0,DGET(Vaktperiode0,D$20,$B141:$B142),0)","v":0},{"$f":"IF(E148>0,DGET(Vaktperiode0,E$20,$B141:$B142),0)","v":0},{"$f":"IF(F148>0,DGET(Vaktperiode0,F$20,$B141:$B142),0)","v":0}]
[{"$f":"Vaktliste!$A$2","v":1},"Beløp",null,{"$f":"D149*D148","v":0},{"$f":"E149*E148","v":0},{"$f":"F149*F148","v":0},null,{"$f":"SUM(D150:F150)","v":0}]
[null,"Sum antall vakter / beløp",null,{"$f":"D28+D38+D48+D58+D68+D78+D88+D98+D108+D118+D128+D138+D148","v":0},{"$f":"E28+E38+E48+E58+E68+E78+E88+E98+E108+E118+E128+E138+E148","v":0},{"$f":"F28+F38+F48+F58+F68+F78+F88+F98+F108+F118+F128+F138+F148","v":0},null,{"$f":"SUM(H27:H150)","v":0}]

{"sheet":"nn (9)","index":9,"n_rows":151,"n_cols":8,"rows_kept":151,"cut":false,"hidden":false,"merged":[[150,5,150,6],[148,1,148,2],[148,5,148,6],[149,1,149,2],[149,5,149,6],[139,1,139,2],[139,5,139,6],[146,1,146,2],[146,5,146,6],[147,1,147,2],[127,1,127,2],[127,5,127,6],[128,1,128,2],[128,5,128,6],[129,1,129,2],[129,5,129,6],[147,5,147,6],[136,1,136,2],[136,5,136,6],[137,1,137,2],[137,5,137,6],[138,1,138,2],[138,5,138,6],[11,3,11,4],[3,2,3,6],[5,2,5,6],[9,2,9,4],[7,2,7,6],[126,1,126,2],[126,5,126,6],[27,1,27,2],[27,5,27,6],[28,1,28,2],[29,1,29,2],[29,5,29,6],[36,1,36,2],[36,5,36,6],[28,5,28,6],[16,3,16,6],[17,3,17,6],[19,5,19,6],[26,1,26,2],[26,5,26,6],[47,1,47,2],[47,5,47,6],[48,1,48,2],[48,5,48,6],[39,1,39,2],[39,5,39,6],[46,1,46,2],[46,5,46,6],[37,1,37,2],[37,5,37,6],[38,1,38,2],[38,5,38,6],[59,1,59,2],[59,5,59,6],[66,1,66,2],[66,5,66,6],[57,1,57,2],[57,5,57,6],[58,1,58,2],[58,5,58,6],[49,1,49,2],[49,5,49,6],[56,1,56,2],[56,5,56,6],[77,1,77,2],[77,5,77,6],[78,1,78,2],[78,5,78,6],[69,1,69,2],[69,5,69,6],[76,1,76,2],[76,5,76,6],[67,1,67,2],[67,5,67,6],[68,1,68,2],[68,5,68,6],[89,1,89,2],[89,5,89,6],[96,1,96,2],[96,5,96,6],[87,1,87,2],[87,5,87,6],[88,1,88,2],[88,5,88,6],[79,1,79,2],[79,5,79,6],[86,1,86,2],[86,5,86,6],[12,2,12,6],[119,1,119,2],[119,5,119,6],[13,2,13,3],[117,1,117,2],[117,5,117,6],[118,1,118,2],[118,5,118,6],[109,1,109,2],[109,5,109,6],[116,1,116,2],[116,5,116,6],[107,1,107,2],[107,5,107,6],[108,1,108,2],[108,5,108,6],[99,1,99,2],[99,5,99,6],[106,1,106,2],[106,5,106,6],[97,1,97,2],[97,5,97,6],[98,1,98,2],[98,5,98,6]]}
[null,"REGNING"]
[null,"GODTGJØRING FOR DELTAKELSE I KLINISK VETERINÆRVAKT"]
[]
[null,"Navn:",null,null,null,null,null,"Fakturadato:"]
[null,null,null,null,null,null,null,"Forfallsdato:"]
[null,"Adresse:"]
[]
[null,"Postnummer, -sted:"]
[]
[null,"Bankgirokontonr:"]
[]
[null,"Organisasjonsnummer:","NO",null,null,"MVA"]
[null,"Fullt navn:"]
[null,"Initialer:","nn9"]
[null,"Regningen gjelder vakttjeneste i vaktområdet (jfr. vaktliste):"]
[null,{"$f":"Vaktliste!E1","v":"Primært vaktområde"}]
[null,"for perioden:"]
[null,{"$f":"Vaktliste!B3","v":"2026-01-01"},null,{"$f":"Vaktliste!E4","v":0}]
[]
[null,"Vakttype - antall vakter",null,"Ordinær","Sesong","Vakans",null,"Beløp"]
["X","Vaktperiode",null,"Ordinær"]
[{"$f":"Vaktliste!$A$2","v":1},"1a",null,{"$f":"$C$14","v":"nn9"}]
["X","Vaktperiode",null,null,"Sesong"]
[{"$f":"Vaktliste!$A$2","v":1},{"$f":"B22","v":"1a"},null,null,{"$f":"$C$14","v":"nn9"}]
["X","Vaktperiode",null,null,null,null,"Vakans"]
[{"$f":"Vaktliste!$A$2","v":1},{"$f":"B24","v":"1a"},null,null,null,null,{"$f":"$C$14","v":"nn9"}]
["X",{"$f":"VLOOKUP(B22,Vaktperioder,2,0)","v":"Hverdag, kveld 1600 - 2200"},null,{"$f":"DCOUNTA(Vaktliste,5,$A21:$G22)","v":0},{"$f":"DCOUNTA(Vaktliste,6,$A23:$G24)","v":0},{"$f":"DCOUNTA(Vaktliste,7,$A25:$G26)","v":0}]
[{"$f":"Vaktliste!$A$2","v":1},"Timer",null,{"$f":"D27*DGET(Timer,3,$B21:$B22)","v":0},{"$f":"E27*DGET(Timer,3,$B21:$B22)","v":0},{"$f":"F27*DGET(Timer,3,B21:B22)","v":0}]
["X","Satser",null,{"$f":"IF(D28>0,DGET(Vaktperiode0,D$20,$B21:$B22),0)","v":0},{"$f":"IF(E28>0,DGET(Vaktperiode0,E$20,$B21:$B22),0)","v":0},{"$f":"IF(F28>0,DGET(Vaktperiode0,F$20,$B21:$B22),0)","v":0}]
[{"$f":"Vaktliste!$A$2","v":1},"Beløp",null,{"$f":"D29*D28","v":0},{"$f":"E29*E28","v":0},{"$f":"F29*F28","v":0},null,{"$f":"SUM(D30:F30)","v":0}]
["X","Vaktperiode",null,"Ordinær"]
[{"$f":"Vaktliste!$A$2","v":1},"2a",null,{"$f":"$C$14","v":"nn9"}]
["X","Vaktperiode",null,null,"Sesong"]
[{"$f":"Vaktliste!$A$2","v":1},{"$f":"B32","v":"2a"},null,null,{"$f":"$C$14","v":"nn9"}]
["X","Vaktperiode",null,null,null,null,"Vakans"]
[{"$f":"Vaktliste!$A$2","v":1},{"$f":"B34","v":"2a"},null,null,null,null,{"$f":"$C$14","v":"nn9"}]
["X",{"$f":"VLOOKUP(B32,Vaktperioder,2,0)","v":"Hverdag, morgen 0600 - 0800"},null,{"$f":"DCOUNTA(Vaktliste,5,$A31:$G32)","v":0},{"$f":"DCOUNTA(Vaktliste,6,$A33:$G34)","v":0},{"$f":"DCOUNTA(Vaktliste,7,$A35:$G36)","v":0}]
[{"$f":"Vaktliste!$A$2","v":1},"Timer",null,{"$f":"D37*DGET(Timer,3,$B31:$B32)","v":0},{"$f":"E37*DGET(Timer,3,$B31:$B32)","v":0},{"$f":"F37*DGET(Timer,3,B31:B32)","v":0}]
["X","Satser",null,{"$f":"IF(D38>0,DGET(Vaktperiode0,D$20,$B31:$B32),0)","v":0},{"$f":"IF(E38>0,DGET(Vaktperiode0,E$20,$B31:$B32),0)","v":0},{"$f":"IF(F38>0,DGET(Vaktperiode0,F$20,$B31:$B32),0)","v":0}]
[{"$f":"Vaktliste!$A$2","v":1},"Beløp",null,{"$f":"D39*D38","v":0},{"$f":"E39*E38","v":0},{"$f":"F39*F38","v":0},null,{"$f":"SUM(D40:F40)","v":0}]
["X","Vaktperiode",null,"Ordinær"]
[{"$f":"Vaktliste!$A$2","v":1},"3a",null,{"$f":"$C$14","v":"nn9"}]
["X","Vaktperiode",null,null,"Sesong"]
[{"$f":"Vaktliste!$A$2","v":1},{"$f":"B42","v":"3a"},null,null,{"$f":"$C$14","v":"nn9"}]
["X","Vaktperiode",null,null,null,null,"Vakans"]
[{"$f":"Vaktliste!$A$2","v":1},{"$f":"B44","v":"3a"},null,null,null,null,{"$f":"$C$14","v":"nn9"}]
["X",{"$f":"VLOOKUP(B42,Vaktperioder,2,0)","v":"Lørdag, søndag 0600 - 2200"},null,{"$f":"DCOUNTA(Vaktliste,5,$A41:$G42)","v":0},{"$f":"DCOUNTA(Vaktliste,6,$A43:$G44)","v":0},{"$f":"DCOUNTA(Vaktliste,7,$A45:$G46)","v":0}]
[{"$f":"Vaktliste!$A$2","v":1},"Timer",null,{"$f":"D47*DGET(Timer,3,$B41:$B42)","v":0},{"$f":"E47*DGET(Timer,3,$B41:$B42)","v":0},{"$f":"F47*DGET(Timer,3,B41:B42)","v":0}]
["X","Satser",null,{"$f":"IF(D48>0,DGET(Vaktperiode0,D$20,$B41:$B42),0)","v":0},{"$f":"IF(E48>0,DGET(Vaktperiode0,E$20,$B41:$B42),0)","v":0},{"$f":"IF(F48>0,DGET(Vaktperiode0,F$20,$B41:$B42),0)","v":0}]
[{"$f":"Vaktliste!$A$2","v":1},"Beløp",null,{"$f":"D49*D48","v":0},{"$f":"E49*E48","v":0},{"$f":"F49*F48","v":0},null,{"$f":"SUM(D50:F50)","v":0}]
["X","Vaktperiode",null,"Ordinær"]
[{"$f":"Vaktliste!$A$2","v":1},"3b",null,{"$f":"$C$14","v":"nn9"}]
["X","Vaktperiode",null,null,"Sesong"]
[{"$f":"Vaktliste!$A$2","v":1},{"$f":"B52","v":"3b"},null,null,{"$f":"$C$14","v":"nn9"}]
["X","Vaktperiode",null,null,null,null,"Vakans"]
[{"$f":"Vaktliste!$A$2","v":1},{"$f":"B54","v":"3b"},null,null,null,null,{"$f":"$C$14","v":"nn9"}]
["X",{"$f":"VLOOKUP(B52,Vaktperioder,2,0)","v":"Hellig- og høytidsdag 0600 - 2200"},null,{"$f":"DCOUNTA(Vaktliste,5,$A51:$G52)","v":0},{"$f":"DCOUNTA(Vaktliste,6,$A53:$G54)","v":0},{"$f":"DCOUNTA(Vaktliste,7,$A55:$G56)","v":0}]
[{"$f":"Vaktliste!$A$2","v":1},"Timer",null,{"$f":"D57*DGET(Timer,3,$B51:$B52)","v":0},{"$f":"E57*DGET(Timer,3,$B51:$B52)","v":0},{"$f":"F57*DGET(Timer,3,B51:B52)","v":0}]
["X","Satser",null,{"$f":"IF(D58>0,DGET(Vaktperiode0,D$20,$B51:$B52),0)","v":0},{"$f":"IF(E58>0,DGET(Vaktperiode0,E$20,$B51:$B52),0)","v":0},{"$f":"IF(F58>0,DGET(Vaktperiode0,F$20,$B51:$B52),0)","v":0}]
[{"$f":"Vaktliste!$A$2","v":1},"Beløp",null,{"$f":"D59*D58","v":0},{"$f":"E59*E58","v":0},{"$f":"F59*F58","v":0},null,{"$f":"SUM(D60:F60)","v":0}]
["X","Vaktperiode",null,"Ordinær"]
[{"$f":"Vaktliste!$A$2","v":1},"3c",null,{"$f":"$C$14","v":"nn9"}]
["X","Vaktperiode",null,null,"Sesong"]
[{"$f":"Vaktliste!$A$2","v":1},{"$f":"B62","v":"3c"},null,null,{"$f":"$C$14","v":"nn9"}]
["X","Vaktperiode",null,null,null,null,"Vakans"]
[{"$f":"Vaktliste!$A$2","v":1},{"$f":"B64","v":"3c"},null,null,null,null,{"$f":"$C$14","v":"nn9"}]
["X",{"$f":"VLOOKUP(B62,Vaktperioder,2,0)","v":"Jul- og nyttårsaften 0600 - 1200"},null,{"$f":"DCOUNTA(Vaktliste,5,$A61:$G62)","v":0},{"$f":"DCOUNTA(Vaktliste,6,$A63:$G64)","v":0},{"$f":"DCOUNTA(Vaktliste,7,$A65:$G66)","v":0}]
[{"$f":"Vaktliste!$A$2","v":1},"Timer",null,{"$f":"D67*DGET(Timer,3,$B61:$B62)","v":0},{"$f":"E67*DGET(Timer,3,$B61:$B62)","v":0},{"$f":"F67*DGET(Timer,3,B61:B62)","v":0}]
["X","Satser",null,{"$f":"IF(D68>0,DGET(Vaktperiode0,D$20,$B61:$B62),0)","v":0},{"$f":"IF(E68>0,DGET(Vaktperiode0,E$20,$B61:$B62),0)","v":0},{"$f":"IF(F68>0,DGET(Vaktperiode0,F$20,$B61:$B62),0)","v":0}]
[{"$f":"Vaktliste!$A$2","v":1},"Beløp",null,{"$f":"D69*D68","v":0},{"$f":"E69*E68","v":0},{"$f":"F69*F68","v":0},null,{"$f":"SUM(D70:F70)","v":0}]
["X","Vaktperiode",null,"Ordinær"]
[{"$f":"Vaktliste!$A$2","v":1},"3d",null,{"$f":"$C$14","v":"nn9"}]
["X","Vaktperiode",null,null,"Sesong"]
[{"$f":"Vaktliste!$A$2","v":1},{"$f":"B72","v":"3d"},null,null,{"$f":"$C$14","v":"nn9"}]
["X","Vaktperiode",null,null,null,null,"Vakans"]
[{"$f":"Vaktliste!$A$2","v":1},{"$f":"B74","v":"3d"},null,null,null,null,{"$f":"$C$14","v":"nn9"}]
["X",{"$f":"VLOOKUP(B72,Vaktperioder,2,0)","v":"Påske-, jul- og nyttårsaften 1200 - 2200"},null,{"$f":"DCOUNTA(Vaktliste,5,$A71:$G72)","v":0},{"$f":"DCOUNTA(Vaktliste,6,$A73:$G74)","v":0},{"$f":"DCOUNTA(Vaktliste,7,$A75:$G76)","v":0}]
[{"$f":"Vaktliste!$A$2","v":1},"Timer",null,{"$f":"D77*DGET(Timer,3,$B71:$B72)","v":0},{"$f":"E77*DGET(Timer,3,$B71:$B72)","v":0},{"$f":"F77*DGET(Timer,3,B71:B72)","v":0}]
["X","Satser",null,{"$f":"IF(D78>0,DGET(Vaktperiode0,D$20,$B71:$B72),0)","v":0},{"$f":"IF(E78>0,DGET(Vaktperiode0,E$20,$B71:$B72),0)","v":0},{"$f":"IF(F78>0,DGET(Vaktperiode0,F$20,$B71:$B72),0)","v":0}]
[{"$f":"Vaktliste!$A$2","v":1},"Beløp",null,{"$f":"D79*D78","v":0},{"$f":"E79*E78","v":0},{"$f":"F79*F78","v":0},null,{"$f":"SUM(D80:F80)","v":0}]
["X","Vaktperiode",null,"Ordinær"]
[{"$f":"Vaktliste!$A$2","v":1},"3e",null,{"$f":"$C$14","v":"nn9"}]
["X","Vaktperiode",null,null,"Sesong"]
[{"$f":"Vaktliste!$A$2","v":1},{"$f":"B82","v":"3e"},null,null,{"$f":"$C$14","v":"nn9"}]
["X","Vaktperiode",null,null,null,null,"Vakans"]
[{"$f":"Vaktliste!$A$2","v":1},{"$f":"B84","v":"3e"},null,null,null,null,{"$f":"$C$14","v":"nn9"}]
["X",{"$f":"VLOOKUP(B82,Vaktperioder,2,0)","v":"Påskeaften 0600 - 1200"},null,{"$f":"DCOUNTA(Vaktliste,5,$A81:$G82)","v":0},{"$f":"DCOUNTA(Vaktliste,6,$A83:$G84)","v":0},{"$f":"DCOUNTA(Vaktliste,7,$A85:$G86)","v":0}]
[{"$f":"Vaktliste!$A$2","v":1},"Timer",null,{"$f":"D87*DGET(Timer,3,$B81:$B82)","v":0},{"$f":"E87*DGET(Timer,3,$B81:$B82)","v":0},{"$f":"F87*DGET(Timer,3,B81:B82)","v":0}]
["X","Satser",null,{"$f":"IF(D88>0,DGET(Vaktperiode0,D$20,$B81:$B82),0)","v":0},{"$f":"IF(E88>0,DGET(Vaktperiode0,E$20,$B81:$B82),0)","v":0},{"$f":"IF(F88>0,DGET(Vaktperiode0,F$20,$B81:$B82),0)","v":0}]
[{"$f":"Vaktliste!$A$2","v":1},"Beløp",null,{"$f":"D89*D88","v":0},{"$f":"E89*E88","v":0},{"$f":"F89*F88","v":0},null,{"$f":"SUM(D90:F90)","v":0}]
["X","Vaktperiode",null,"Ordinær"]
[{"$f":"Vaktliste!$A$2","v":1},"4a",null,{"$f":"$C$14","v":"nn9"}]
["X","Vaktperiode",null,null,"Sesong"]
[{"$f":"Vaktliste!$A$2","v":1},{"$f":"B92","v":"4a"},null,null,{"$f":"$C$14","v":"nn9"}]
["X","Vaktperiode",null,null,null,null,"Vakans"]
[{"$f":"Vaktliste!$A$2","v":1},{"$f":"B94","v":"4a"},null,null,null,null,{"$f":"$C$14","v":"nn9"}]
["X",{"$f":"VLOOKUP(B92,Vaktperioder,2,0)","v":"Natt hverdag 2200 - 2400"},null,{"$f":"DCOUNTA(Vaktliste,5,$A91:$G92)","v":0},{"$f":"DCOUNTA(Vaktliste,6,$A93:$G94)","v":0},{"$f":"DCOUNTA(Vaktliste,7,$A95:$G96)","v":0}]
[{"$f":"Vaktliste!$A$2","v":1},"Timer",null,{"$f":"D97*DGET(Timer,3,$B91:$B92)","v":0},{"$f":"E97*DGET(Timer,3,$B91:$B92)","v":0},{"$f":"F97*DGET(Timer,3,B91:B92)","v":0}]
["X","Satser",null,{"$f":"IF(D98>0,DGET(Vaktperiode0,D$20,$B91:$B92),0)","v":0},{"$f":"IF(E98>0,DGET(Vaktperiode0,E$20,$B91:$B92),0)","v":0},{"$f":"IF(F98>0,DGET(Vaktperiode0,F$20,$B91:$B92),0)","v":0}]
[{"$f":"Vaktliste!$A$2","v":1},"Beløp",null,{"$f":"D99*D98","v":0},{"$f":"E99*E98","v":0},{"$f":"F99*F98","v":0},null,{"$f":"SUM(D100:F100)","v":0}]
["X","Vaktperiode",null,"Ordinær"]
[{"$f":"Vaktliste!$A$2","v":1},"4b",null,{"$f":"$C$14","v":"nn9"}]
["X","Vaktperiode",null,null,"Sesong"]
[{"$f":"Vaktliste!$A$2","v":1},{"$f":"B102","v":"4b"},null,null,{"$f":"$C$14","v":"nn9"}]
["X","Vaktperiode",null,null,null,null,"Vakans"]
[{"$f":"Vaktliste!$A$2","v":1},{"$f":"B104","v":"4b"},null,null,null,null,{"$f":"$C$14","v":"nn9"}]
["X",{"$f":"VLOOKUP(B102,Vaktperioder,2,0)","v":"Natt hverdag 0000 - 0600"},null,{"$f":"DCOUNTA(Vaktliste,5,$A101:$G102)","v":0},{"$f":"DCOUNTA(Vaktliste,6,$A103:$G104)","v":0},{"$f":"DCOUNTA(Vaktliste,7,$A105:$G106)","v":0}]
[{"$f":"Vaktliste!$A$2","v":1},"Timer",null,{"$f":"D107*DGET(Timer,3,$B101:$B102)","v":0},{"$f":"E107*DGET(Timer,3,$B101:$B102)","v":0},{"$f":"F107*DGET(Timer,3,B101:B102)","v":0}]
["X","Satser",null,{"$f":"IF(D108>0,DGET(Vaktperiode0,D$20,$B101:$B102),0)","v":0},{"$f":"IF(E108>0,DGET(Vaktperiode0,E$20,$B101:$B102),0)","v":0},{"$f":"IF(F108>0,DGET(Vaktperiode0,F$20,$B101:$B102),0)","v":0}]
[{"$f":"Vaktliste!$A$2","v":1},"Beløp",null,{"$f":"D109*D108","v":0},{"$f":"E109*E108","v":0},{"$f":"F109*F108","v":0},null,{"$f":"SUM(D110:F110)","v":0}]
["X","Vaktperiode",null,"Ordinær"]
[{"$f":"Vaktliste!$A$2","v":1},"4c",null,{"$f":"$C$14","v":"nn9"}]
["X","Vaktperiode",null,null,"Sesong"]
[{"$f":"Vaktliste!$A$2","v":1},{"$f":"B112","v":"4c"},null,null,{"$f":"$C$14","v":"nn9"}]
["X","Vaktperiode",null,null,null,null,"Vakans"]
[{"$f":"Vaktliste!$A$2","v":1},{"$f":"B114","v":"4c"},null,null,null,null,{"$f":"$C$14","v":"nn9"}]
["X",{"$f":"VLOOKUP(B112,Vaktperioder,2,0)","v":"Natt lørdag, søndag 2200 - 2400"},null,{"$f":"DCOUNTA(Vaktliste,5,$A111:$G112)","v":0},{"$f":"DCOUNTA(Vaktliste,6,$A113:$G114)","v":0},{"$f":"DCOUNTA(Vaktliste,7,$A115:$G116)","v":0}]
[{"$f":"Vaktliste!$A$2","v":1},"Timer",null,{"$f":"D117*DGET(Timer,3,$B111:$B112)","v":0},{"$f":"E117*DGET(Timer,3,$B111:$B112)","v":0},{"$f":"F117*DGET(Timer,3,B111:B112)","v":0}]
["X","Satser",null,{"$f":"IF(D118>0,DGET(Vaktperiode0,D$20,$B111:$B112),0)","v":0},{"$f":"IF(E118>0,DGET(Vaktperiode0,E$20,$B111:$B112),0)","v":0},{"$f":"IF(F118>0,DGET(Vaktperiode0,F$20,$B111:$B112),0)","v":0}]
[{"$f":"Vaktliste!$A$2","v":1},"Beløp",null,{"$f":"D119*D118","v":0},{"$f":"E119*E118","v":0},{"$f":"F119*F118","v":0},null,{"$f":"SUM(D120:F120)","v":0}]
["X","Vaktperiode",null,"Ordinær"]
[{"$f":"Vaktliste!$A$2","v":1},"4d",null,{"$f":"$C$14","v":"nn9"}]
["X","Vaktperiode",null,null,"Sesong"]
[{"$f":"Vaktliste!$A$2","v":1},{"$f":"B122","v":"4d"},null,null,{"$f":"$C$14","v":"nn9"}]
["X","Vaktperiode",null,null,null,null,"Vakans"]
[{"$f":"Vaktliste!$A$2","v":1},{"$f":"B124","v":"4d"},null,null,null,null,{"$f":"$C$14","v":"nn9"}]
["X",{"$f":"VLOOKUP(B122,Vaktperioder,2,0)","v":"Natt lørdag, søndag 0000 - 0600"},null,{"$f":"DCOUNTA(Vaktliste,5,$A121:$G122)","v":0},{"$f":"DCOUNTA(Vaktliste,6,$A123:$G124)","v":0},{"$f":"DCOUNTA(Vaktliste,7,$A125:$G126)","v":0}]
[{"$f":"Vaktliste!$A$2","v":1},"Timer",null,{"$f":"D127*DGET(Timer,3,$B121:$B122)","v":0},{"$f":"E127*DGET(Timer,3,$B121:$B122)","v":0},{"$f":"F127*DGET(Timer,3,B121:B122)","v":0}]
["X","Satser",null,{"$f":"IF(D128>0,DGET(Vaktperiode0,D$20,$B121:$B122),0)","v":0},{"$f":"IF(E128>0,DGET(Vaktperiode0,E$20,$B121:$B122),0)","v":0},{"$f":"IF(F128>0,DGET(Vaktperiode0,F$20,$B121:$B122),0)","v":0}]
[{"$f":"Vaktliste!$A$2","v":1},"Beløp",null,{"$f":"D129*D128","v":0},{"$f":"E129*E128","v":0},{"$f":"F129*F128","v":0},null,{"$f":"SUM(D130:F130)","v":0}]
["X","Vaktperiode",null,"Ordinær"]
[{"$f":"Vaktliste!$A$2","v":1},"4e",null,{"$f":"$C$14","v":"nn9"}]
["X","Vaktperiode",null,null,"Sesong"]
[{"$f":"Vaktliste!$A$2","v":1},{"$f":"B132","v":"4e"},null,null,{"$f":"$C$14","v":"nn9"}]
["X","Vaktperiode",null,null,null,null,"Vakans"]
[{"$f":"Vaktliste!$A$2","v":1},{"$f":"B134","v":"4e"},null,null,null,null,{"$f":"$C$14","v":"nn9"}]
["X",{"$f":"VLOOKUP(B132,Vaktperioder,2,0)","v":"Natt hellig- og høytidsdag 2200 - 2400"},null,{"$f":"DCOUNTA(Vaktliste,5,$A131:$G132)","v":0},{"$f":"DCOUNTA(Vaktliste,6,$A133:$G134)","v":0},{"$f":"DCOUNTA(Vaktliste,7,$A135:$G136)","v":0}]
[{"$f":"Vaktliste!$A$2","v":1},"Timer",null,{"$f":"D137*DGET(Timer,3,$B131:$B132)","v":0},{"$f":"E137*DGET(Timer,3,$B131:$B132)","v":0},{"$f":"F137*DGET(Timer,3,B131:B132)","v":0}]
["X","Satser",null,{"$f":"IF(D138>0,DGET(Vaktperiode0,D$20,$B131:$B132),0)","v":0},{"$f":"IF(E138>0,DGET(Vaktperiode0,E$20,$B131:$B132),0)","v":0},{"$f":"IF(F138>0,DGET(Vaktperiode0,F$20,$B131:$B132),0)","v":0}]
[{"$f":"Vaktliste!$A$2","v":1},"Beløp",null,{"$f":"D139*D138","v":0},{"$f":"E139*E138","v":0},{"$f":"F139*F138","v":0},null,{"$f":"SUM(D140:F140)","v":0}]
["X","Vaktperiode",null,"Ordinær"]
[{"$f":"Vaktliste!$A$2","v":1},"4f",null,{"$f":"$C$14","v":"nn9"}]
["X","Vaktperiode",null,null,"Sesong"]
[{"$f":"Vaktliste!$A$2","v":1},{"$f":"B142","v":"4f"},null,null,{"$f":"$C$14","v":"nn9"}]
["X","Vaktperiode",null,null,null,null,"Vakans"]
[{"$f":"Vaktliste!$A$2","v":1},{"$f":"B144","v":"4f"},null,null,null,null,{"$f":"$C$14","v":"nn9"}]
["X",{"$f":"VLOOKUP(B142,Vaktperioder,2,0)","v":"Natt hellig- og høytidsdag 0000 - 0600"},null,{"$f":"DCOUNTA(Vaktliste,5,$A141:$G142)","v":0},{"$f":"DCOUNTA(Vaktliste,6,$A143:$G144)","v":0},{"$f":"DCOUNTA(Vaktliste,7,$A145:$G146)","v":0}]
[{"$f":"Vaktliste!$A$2","v":1},"Timer",null,{"$f":"D147*DGET(Timer,3,$B141:$B142)","v":0},{"$f":"E147*DGET(Timer,3,$B141:$B142)","v":0},{"$f":"F147*DGET(Timer,3,B141:B142)","v":0}]
["X","Satser",null,{"$f":"IF(D148>0,DGET(Vaktperiode0,D$20,$B141:$B142),0)","v":0},{"$f":"IF(E148>0,DGET(Vaktperiode0,E$20,$B141:$B142),0)","v":0},{"$f":"IF(F148>0,DGET(Vaktperiode0,F$20,$B141:$B142),0)","v":0}]
[{"$f":"Vaktliste!$A$2","v":1},"Beløp",null,{"$f":"D149*D148","v":0},{"$f":"E149*E148","v":0},{"$f":"F149*F148","v":0},null,{"$f":"SUM(D150:F150)","v":0}]
[null,"Sum antall vakter / beløp",null,{"$f":"D28+D38+D48+D58+D68+D78+D88+D98+D108+D118+D128+D138+D148","v":0},{"$f":"E28+E38+E48+E58+E68+E78+E88+E98+E108+E118+E128+E138+E148","v":0},{"$f":"F28+F38+F48+F58+F68+F78+F88+F98+F108+F118+F128+F138+F148","v":0},null,{"$f":"SUM(H27:H150)","v":0}]

{"sheet":"nn (10)","index":10,"n_rows":151,"n_cols":8,"rows_kept":151,"cut":false,"hidden":false,"merged":[[150,5,150,6],[148,1,148,2],[148,5,148,6],[149,1,149,2],[149,5,149,6],[139,1,139,2],[139,5,139,6],[146,1,146,2],[146,5,146,6],[147,1,147,2],[127,1,127,2],[127,5,127,6],[128,1,128,2],[128,5,128,6],[129,1,129,2],[129,5,129,6],[147,5,147,6],[136,1,136,2],[136,5,136,6],[137,1,137,2],[137,5,137,6],[138,1,138,2],[138,5,138,6],[11,3,11,4],[3,2,3,6],[5,2,5,6],[9,2,9,4],[7,2,7,6],[126,1,126,2],[126,5,126,6],[27,1,27,2],[27,5,27,6],[28,1,28,2],[29,1,29,2],[29,5,29,6],[36,1,36,2],[36,5,36,6],[28,5,28,6],[16,3,16,6],[17,3,17,6],[19,5,19,6],[26,1,26,2],[26,5,26,6],[47,1,47,2],[47,5,47,6],[48,1,48,2],[48,5,48,6],[39,1,39,2],[39,5,39,6],[46,1,46,2],[46,5,46,6],[37,1,37,2],[37,5,37,6],[38,1,38,2],[38,5,38,6],[59,1,59,2],[59,5,59,6],[66,1,66,2],[66,5,66,6],[57,1,57,2],[57,5,57,6],[58,1,58,2],[58,5,58,6],[49,1,49,2],[49,5,49,6],[56,1,56,2],[56,5,56,6],[77,1,77,2],[77,5,77,6],[78,1,78,2],[78,5,78,6],[69,1,69,2],[69,5,69,6],[76,1,76,2],[76,5,76,6],[67,1,67,2],[67,5,67,6],[68,1,68,2],[68,5,68,6],[89,1,89,2],[89,5,89,6],[96,1,96,2],[96,5,96,6],[87,1,87,2],[87,5,87,6],[88,1,88,2],[88,5,88,6],[79,1,79,2],[79,5,79,6],[86,1,86,2],[86,5,86,6],[12,2,12,6],[119,1,119,2],[119,5,119,6],[13,2,13,3],[117,1,117,2],[117,5,117,6],[118,1,118,2],[118,5,118,6],[109,1,109,2],[109,5,109,6],[116,1,116,2],[116,5,116,6],[107,1,107,2],[107,5,107,6],[108,1,108,2],[108,5,108,6],[99,1,99,2],[99,5,99,6],[106,1,106,2],[106,5,106,6],[97,1,97,2],[97,5,97,6],[98,1,98,2],[98,5,98,6]]}
[null,"REGNING"]
[null,"GODTGJØRING FOR DELTAKELSE I KLINISK VETERINÆRVAKT"]
[]
[null,"Navn:",null,null,null,null,null,"Fakturadato:"]
[null,null,null,null,null,null,null,"Forfallsdato:"]
[null,"Adresse:"]
[]
[null,"Postnummer, -sted:"]
[]
[null,"Bankgirokontonr:"]
[]
[null,"Organisasjonsnummer:","NO",null,null,"MVA"]
[null,"Fullt navn:"]
[null,"Initialer:","nn0"]
[null,"Regningen gjelder vakttjeneste i vaktområdet (jfr. vaktliste):"]
[null,{"$f":"Vaktliste!E1","v":"Primært vaktområde"}]
[null,"for perioden:"]
[null,{"$f":"Vaktliste!B3","v":"2026-01-01"},null,{"$f":"Vaktliste!E4","v":0}]
[]
[null,"Vakttype - antall vakter",null,"Ordinær","Sesong","Vakans",null,"Beløp"]
["X","Vaktperiode",null,"Ordinær"]
[{"$f":"Vaktliste!$A$2","v":1},"1a",null,{"$f":"$C$14","v":"nn0"}]
["X","Vaktperiode",null,null,"Sesong"]
[{"$f":"Vaktliste!$A$2","v":1},{"$f":"B22","v":"1a"},null,null,{"$f":"$C$14","v":"nn0"}]
["X","Vaktperiode",null,null,null,null,"Vakans"]
[{"$f":"Vaktliste!$A$2","v":1},{"$f":"B24","v":"1a"},null,null,null,null,{"$f":"$C$14","v":"nn0"}]
["X",{"$f":"VLOOKUP(B22,Vaktperioder,2,0)","v":"Hverdag, kveld 1600 - 2200"},null,{"$f":"DCOUNTA(Vaktliste,5,$A21:$G22)","v":0},{"$f":"DCOUNTA(Vaktliste,6,$A23:$G24)","v":0},{"$f":"DCOUNTA(Vaktliste,7,$A25:$G26)","v":0}]
[{"$f":"Vaktliste!$A$2","v":1},"Timer",null,{"$f":"D27*DGET(Timer,3,$B21:$B22)","v":0},{"$f":"E27*DGET(Timer,3,$B21:$B22)","v":0},{"$f":"F27*DGET(Timer,3,B21:B22)","v":0}]
["X","Satser",null,{"$f":"IF(D28>0,DGET(Vaktperiode0,D$20,$B21:$B22),0)","v":0},{"$f":"IF(E28>0,DGET(Vaktperiode0,E$20,$B21:$B22),0)","v":0},{"$f":"IF(F28>0,DGET(Vaktperiode0,F$20,$B21:$B22),0)","v":0}]
[{"$f":"Vaktliste!$A$2","v":1},"Beløp",null,{"$f":"D29*D28","v":0},{"$f":"E29*E28","v":0},{"$f":"F29*F28","v":0},null,{"$f":"SUM(D30:F30)","v":0}]
["X","Vaktperiode",null,"Ordinær"]
[{"$f":"Vaktliste!$A$2","v":1},"2a",null,{"$f":"$C$14","v":"nn0"}]
["X","Vaktperiode",null,null,"Sesong"]
[{"$f":"Vaktliste!$A$2","v":1},{"$f":"B32","v":"2a"},null,null,{"$f":"$C$14","v":"nn0"}]
["X","Vaktperiode",null,null,null,null,"Vakans"]
[{"$f":"Vaktliste!$A$2","v":1},{"$f":"B34","v":"2a"},null,null,null,null,{"$f":"$C$14","v":"nn0"}]
["X",{"$f":"VLOOKUP(B32,Vaktperioder,2,0)","v":"Hverdag, morgen 0600 - 0800"},null,{"$f":"DCOUNTA(Vaktliste,5,$A31:$G32)","v":0},{"$f":"DCOUNTA(Vaktliste,6,$A33:$G34)","v":0},{"$f":"DCOUNTA(Vaktliste,7,$A35:$G36)","v":0}]
[{"$f":"Vaktliste!$A$2","v":1},"Timer",null,{"$f":"D37*DGET(Timer,3,$B31:$B32)","v":0},{"$f":"E37*DGET(Timer,3,$B31:$B32)","v":0},{"$f":"F37*DGET(Timer,3,B31:B32)","v":0}]
["X","Satser",null,{"$f":"IF(D38>0,DGET(Vaktperiode0,D$20,$B31:$B32),0)","v":0},{"$f":"IF(E38>0,DGET(Vaktperiode0,E$20,$B31:$B32),0)","v":0},{"$f":"IF(F38>0,DGET(Vaktperiode0,F$20,$B31:$B32),0)","v":0}]
[{"$f":"Vaktliste!$A$2","v":1},"Beløp",null,{"$f":"D39*D38","v":0},{"$f":"E39*E38","v":0},{"$f":"F39*F38","v":0},null,{"$f":"SUM(D40:F40)","v":0}]
["X","Vaktperiode",null,"Ordinær"]
[{"$f":"Vaktliste!$A$2","v":1},"3a",null,{"$f":"$C$14","v":"nn0"}]
["X","Vaktperiode",null,null,"Sesong"]
[{"$f":"Vaktliste!$A$2","v":1},{"$f":"B42","v":"3a"},null,null,{"$f":"$C$14","v":"nn0"}]
["X","Vaktperiode",null,null,null,null,"Vakans"]
[{"$f":"Vaktliste!$A$2","v":1},{"$f":"B44","v":"3a"},null,null,null,null,{"$f":"$C$14","v":"nn0"}]
["X",{"$f":"VLOOKUP(B42,Vaktperioder,2,0)","v":"Lørdag, søndag 0600 - 2200"},null,{"$f":"DCOUNTA(Vaktliste,5,$A41:$G42)","v":0},{"$f":"DCOUNTA(Vaktliste,6,$A43:$G44)","v":0},{"$f":"DCOUNTA(Vaktliste,7,$A45:$G46)","v":0}]
[{"$f":"Vaktliste!$A$2","v":1},"Timer",null,{"$f":"D47*DGET(Timer,3,$B41:$B42)","v":0},{"$f":"E47*DGET(Timer,3,$B41:$B42)","v":0},{"$f":"F47*DGET(Timer,3,B41:B42)","v":0}]
["X","Satser",null,{"$f":"IF(D48>0,DGET(Vaktperiode0,D$20,$B41:$B42),0)","v":0},{"$f":"IF(E48>0,DGET(Vaktperiode0,E$20,$B41:$B42),0)","v":0},{"$f":"IF(F48>0,DGET(Vaktperiode0,F$20,$B41:$B42),0)","v":0}]
[{"$f":"Vaktliste!$A$2","v":1},"Beløp",null,{"$f":"D49*D48","v":0},{"$f":"E49*E48","v":0},{"$f":"F49*F48","v":0},null,{"$f":"SUM(D50:F50)","v":0}]
["X","Vaktperiode",null,"Ordinær"]
[{"$f":"Vaktliste!$A$2","v":1},"3b",null,{"$f":"$C$14","v":"nn0"}]
["X","Vaktperiode",null,null,"Sesong"]
[{"$f":"Vaktliste!$A$2","v":1},{"$f":"B52","v":"3b"},null,null,{"$f":"$C$14","v":"nn0"}]
["X","Vaktperiode",null,null,null,null,"Vakans"]
[{"$f":"Vaktliste!$A$2","v":1},{"$f":"B54","v":"3b"},null,null,null,null,{"$f":"$C$14","v":"nn0"}]
["X",{"$f":"VLOOKUP(B52,Vaktperioder,2,0)","v":"Hellig- og høytidsdag 0600 - 2200"},null,{"$f":"DCOUNTA(Vaktliste,5,$A51:$G52)","v":0},{"$f":"DCOUNTA(Vaktliste,6,$A53:$G54)","v":0},{"$f":"DCOUNTA(Vaktliste,7,$A55:$G56)","v":0}]
[{"$f":"Vaktliste!$A$2","v":1},"Timer",null,{"$f":"D57*DGET(Timer,3,$B51:$B52)","v":0},{"$f":"E57*DGET(Timer,3,$B51:$B52)","v":0},{"$f":"F57*DGET(Timer,3,B51:B52)","v":0}]
["X","Satser",null,{"$f":"IF(D58>0,DGET(Vaktperiode0,D$20,$B51:$B52),0)","v":0},{"$f":"IF(E58>0,DGET(Vaktperiode0,E$20,$B51:$B52),0)","v":0},{"$f":"IF(F58>0,DGET(Vaktperiode0,F$20,$B51:$B52),0)","v":0}]
[{"$f":"Vaktliste!$A$2","v":1},"Beløp",null,{"$f":"D59*D58","v":0},{"$f":"E59*E58","v":0},{"$f":"F59*F58","v":0},null,{"$f":"SUM(D60:F60)","v":0}]
["X","Vaktperiode",null,"Ordinær"]
[{"$f":"Vaktliste!$A$2","v":1},"3c",null,{"$f":"$C$14","v":"nn0"}]
["X","Vaktperiode",null,null,"Sesong"]
[{"$f":"Vaktliste!$A$2","v":1},{"$f":"B62","v":"3c"},null,null,{"$f":"$C$14","v":"nn0"}]
["X","Vaktperiode",null,null,null,null,"Vakans"]
[{"$f":"Vaktliste!$A$2","v":1},{"$f":"B64","v":"3c"},null,null,null,null,{"$f":"$C$14","v":"nn0"}]
["X",{"$f":"VLOOKUP(B62,Vaktperioder,2,0)","v":"Jul- og nyttårsaften 0600 - 1200"},null,{"$f":"DCOUNTA(Vaktliste,5,$A61:$G62)","v":0},{"$f":"DCOUNTA(Vaktliste,6,$A63:$G64)","v":0},{"$f":"DCOUNTA(Vaktliste,7,$A65:$G66)","v":0}]
[{"$f":"Vaktliste!$A$2","v":1},"Timer",null,{"$f":"D67*DGET(Timer,3,$B61:$B62)","v":0},{"$f":"E67*DGET(Timer,3,$B61:$B62)","v":0},{"$f":"F67*DGET(Timer,3,B61:B62)","v":0}]
["X","Satser",null,{"$f":"IF(D68>0,DGET(Vaktperiode0,D$20,$B61:$B62),0)","v":0},{"$f":"IF(E68>0,DGET(Vaktperiode0,E$20,$B61:$B62),0)","v":0},{"$f":"IF(F68>0,DGET(Vaktperiode0,F$20,$B61:$B62),0)","v":0}]
[{"$f":"Vaktliste!$A$2","v":1},"Beløp",null,{"$f":"D69*D68","v":0},{"$f":"E69*E68","v":0},{"$f":"F69*F68","v":0},null,{"$f":"SUM(D70:F70)","v":0}]
["X","Vaktperiode",null,"Ordinær"]
[{"$f":"Vaktliste!$A$2","v":1},"3d",null,{"$f":"$C$14","v":"nn0"}]
["X","Vaktperiode",null,null,"Sesong"]
[{"$f":"Vaktliste!$A$2","v":1},{"$f":"B72","v":"3d"},null,null,{"$f":"$C$14","v":"nn0"}]
["X","Vaktperiode",null,null,null,null,"Vakans"]
[{"$f":"Vaktliste!$A$2","v":1},{"$f":"B74","v":"3d"},null,null,null,null,{"$f":"$C$14","v":"nn0"}]
["X",{"$f":"VLOOKUP(B72,Vaktperioder,2,0)","v":"Påske-, jul- og nyttårsaften 1200 - 2200"},null,{"$f":"DCOUNTA(Vaktliste,5,$A71:$G72)","v":0},{"$f":"DCOUNTA(Vaktliste,6,$A73:$G74)","v":0},{"$f":"DCOUNTA(Vaktliste,7,$A75:$G76)","v":0}]
[{"$f":"Vaktliste!$A$2","v":1},"Timer",null,{"$f":"D77*DGET(Timer,3,$B71:$B72)","v":0},{"$f":"E77*DGET(Timer,3,$B71:$B72)","v":0},{"$f":"F77*DGET(Timer,3,B71:B72)","v":0}]
["X","Satser",null,{"$f":"IF(D78>0,DGET(Vaktperiode0,D$20,$B71:$B72),0)","v":0},{"$f":"IF(E78>0,DGET(Vaktperiode0,E$20,$B71:$B72),0)","v":0},{"$f":"IF(F78>0,DGET(Vaktperiode0,F$20,$B71:$B72),0)","v":0}]
[{"$f":"Vaktliste!$A$2","v":1},"Beløp",null,{"$f":"D79*D78","v":0},{"$f":"E79*E78","v":0},{"$f":"F79*F78","v":0},null,{"$f":"SUM(D80:F80)","v":0}]
["X","Vaktperiode",null,"Ordinær"]
[{"$f":"Vaktliste!$A$2","v":1},"3e",null,{"$f":"$C$14","v":"nn0"}]
["X","Vaktperiode",null,null,"Sesong"]
[{"$f":"Vaktliste!$A$2","v":1},{"$f":"B82","v":"3e"},null,null,{"$f":"$C$14","v":"nn0"}]
["X","Vaktperiode",null,null,null,null,"Vakans"]
[{"$f":"Vaktliste!$A$2","v":1},{"$f":"B84","v":"3e"},null,null,null,null,{"$f":"$C$14","v":"nn0"}]
["X",{"$f":"VLOOKUP(B82,Vaktperioder,2,0)","v":"Påskeaften 0600 - 1200"},null,{"$f":"DCOUNTA(Vaktliste,5,$A81:$G82)","v":0},{"$f":"DCOUNTA(Vaktliste,6,$A83:$G84)","v":0},{"$f":"DCOUNTA(Vaktliste,7,$A85:$G86)","v":0}]
[{"$f":"Vaktliste!$A$2","v":1},"Timer",null,{"$f":"D87*DGET(Timer,3,$B81:$B82)","v":0},{"$f":"E87*DGET(Timer,3,$B81:$B82)","v":0},{"$f":"F87*DGET(Timer,3,B81:B82)","v":0}]
["X","Satser",null,{"$f":"IF(D88>0,DGET(Vaktperiode0,D$20,$B81:$B82),0)","v":0},{"$f":"IF(E88>0,DGET(Vaktperiode0,E$20,$B81:$B82),0)","v":0},{"$f":"IF(F88>0,DGET(Vaktperiode0,F$20,$B81:$B82),0)","v":0}]
[{"$f":"Vaktliste!$A$2","v":1},"Beløp",null,{"$f":"D89*D88","v":0},{"$f":"E89*E88","v":0},{"$f":"F89*F88","v":0},null,{"$f":"SUM(D90:F90)","v":0}]
["X","Vaktperiode",null,"Ordinær"]
[{"$f":"Vaktliste!$A$2","v":1},"4a",null,{"$f":"$C$14","v":"nn0"}]
["X","Vaktperiode",null,null,"Sesong"]
[{"$f":"Vaktliste!$A$2","v":1},{"$f":"B92","v":"4a"},null,null,{"$f":"$C$14","v":"nn0"}]
["X","Vaktperiode",null,null,null,null,"Vakans"]
[{"$f":"Vaktliste!$A$2","v":1},{"$f":"B94","v":"4a"},null,null,null,null,{"$f":"$C$14","v":"nn0"}]
["X",{"$f":"VLOOKUP(B92,Vaktperioder,2,0)","v":"Natt hverdag 2200 - 2400"},null,{"$f":"DCOUNTA(Vaktliste,5,$A91:$G92)","v":0},{"$f":"DCOUNTA(Vaktliste,6,$A93:$G94)","v":0},{"$f":"DCOUNTA(Vaktliste,7,$A95:$G96)","v":0}]
[{"$f":"Vaktliste!$A$2","v":1},"Timer",null,{"$f":"D97*DGET(Timer,3,$B91:$B92)","v":0},{"$f":"E97*DGET(Timer,3,$B91:$B92)","v":0},{"$f":"F97*DGET(Timer,3,B91:B92)","v":0}]
["X","Satser",null,{"$f":"IF(D98>0,DGET(Vaktperiode0,D$20,$B91:$B92),0)","v":0},{"$f":"IF(E98>0,DGET(Vaktperiode0,E$20,$B91:$B92),0)","v":0},{"$f":"IF(F98>0,DGET(Vaktperiode0,F$20,$B91:$B92),0)","v":0}]
[{"$f":"Vaktliste!$A$2","v":1},"Beløp",null,{"$f":"D99*D98","v":0},{"$f":"E99*E98","v":0},{"$f":"F99*F98","v":0},null,{"$f":"SUM(D100:F100)","v":0}]
["X","Vaktperiode",null,"Ordinær"]
[{"$f":"Vaktliste!$A$2","v":1},"4b",null,{"$f":"$C$14","v":"nn0"}]
["X","Vaktperiode",null,null,"Sesong"]
[{"$f":"Vaktliste!$A$2","v":1},{"$f":"B102","v":"4b"},null,null,{"$f":"$C$14","v":"nn0"}]
["X","Vaktperiode",null,null,null,null,"Vakans"]
[{"$f":"Vaktliste!$A$2","v":1},{"$f":"B104","v":"4b"},null,null,null,null,{"$f":"$C$14","v":"nn0"}]
["X",{"$f":"VLOOKUP(B102,Vaktperioder,2,0)","v":"Natt hverdag 0000 - 0600"},null,{"$f":"DCOUNTA(Vaktliste,5,$A101:$G102)","v":0},{"$f":"DCOUNTA(Vaktliste,6,$A103:$G104)","v":0},{"$f":"DCOUNTA(Vaktliste,7,$A105:$G106)","v":0}]
[{"$f":"Vaktliste!$A$2","v":1},"Timer",null,{"$f":"D107*DGET(Timer,3,$B101:$B102)","v":0},{"$f":"E107*DGET(Timer,3,$B101:$B102)","v":0},{"$f":"F107*DGET(Timer,3,B101:B102)","v":0}]
["X","Satser",null,{"$f":"IF(D108>0,DGET(Vaktperiode0,D$20,$B101:$B102),0)","v":0},{"$f":"IF(E108>0,DGET(Vaktperiode0,E$20,$B101:$B102),0)","v":0},{"$f":"IF(F108>0,DGET(Vaktperiode0,F$20,$B101:$B102),0)","v":0}]
[{"$f":"Vaktliste!$A$2","v":1},"Beløp",null,{"$f":"D109*D108","v":0},{"$f":"E109*E108","v":0},{"$f":"F109*F108","v":0},null,{"$f":"SUM(D110:F110)","v":0}]
["X","Vaktperiode",null,"Ordinær"]
[{"$f":"Vaktliste!$A$2","v":1},"4c",null,{"$f":"$C$14","v":"nn0"}]
["X","Vaktperiode",null,null,"Sesong"]
[{"$f":"Vaktliste!$A$2","v":1},{"$f":"B112","v":"4c"},null,null,{"$f":"$C$14","v":"nn0"}]
["X","Vaktperiode",null,null,null,null,"Vakans"]
[{"$f":"Vaktliste!$A$2","v":1},{"$f":"B114","v":"4c"},null,null,null,null,{"$f":"$C$14","v":"nn0"}]
["X",{"$f":"VLOOKUP(B112,Vaktperioder,2,0)","v":"Natt lørdag, søndag 2200 - 2400"},null,{"$f":"DCOUNTA(Vaktliste,5,$A111:$G112)","v":0},{"$f":"DCOUNTA(Vaktliste,6,$A113:$G114)","v":0},{"$f":"DCOUNTA(Vaktliste,7,$A115:$G116)","v":0}]
[{"$f":"Vaktliste!$A$2","v":1},"Timer",null,{"$f":"D117*DGET(Timer,3,$B111:$B112)","v":0},{"$f":"E117*DGET(Timer,3,$B111:$B112)","v":0},{"$f":"F117*DGET(Timer,3,B111:B112)","v":0}]
["X","Satser",null,{"$f":"IF(D118>0,DGET(Vaktperiode0,D$20,$B111:$B112),0)","v":0},{"$f":"IF(E118>0,DGET(Vaktperiode0,E$20,$B111:$B112),0)","v":0},{"$f":"IF(F118>0,DGET(Vaktperiode0,F$20,$B111:$B112),0)","v":0}]
[{"$f":"Vaktliste!$A$2","v":1},"Beløp",null,{"$f":"D119*D118","v":0},{"$f":"E119*E118","v":0},{"$f":"F119*F118","v":0},null,{"$f":"SUM(D120:F120)","v":0}]
["X","Vaktperiode",null,"Ordinær"]
[{"$f":"Vaktliste!$A$2","v":1},"4d",null,{"$f":"$C$14","v":"nn0"}]
["X","Vaktperiode",null,null,"Sesong"]
[{"$f":"Vaktliste!$A$2","v":1},{"$f":"B122","v":"4d"},null,null,{"$f":"$C$14","v":"nn0"}]
["X","Vaktperiode",null,null,null,null,"Vakans"]
[{"$f":"Vaktliste!$A$2","v":1},{"$f":"B124","v":"4d"},null,null,null,null,{"$f":"$C$14","v":"nn0"}]
["X",{"$f":"VLOOKUP(B122,Vaktperioder,2,0)","v":"Natt lørdag, søndag 0000 - 0600"},null,{"$f":"DCOUNTA(Vaktliste,5,$A121:$G122)","v":0},{"$f":"DCOUNTA(Vaktliste,6,$A123:$G124)","v":0},{"$f":"DCOUNTA(Vaktliste,7,$A125:$G126)","v":0}]
[{"$f":"Vaktliste!$A$2","v":1},"Timer",null,{"$f":"D127*DGET(Timer,3,$B121:$B122)","v":0},{"$f":"E127*DGET(Timer,3,$B121:$B122)","v":0},{"$f":"F127*DGET(Timer,3,B121:B122)","v":0}]
["X","Satser",null,{"$f":"IF(D128>0,DGET(Vaktperiode0,D$20,$B121:$B122),0)","v":0},{"$f":"IF(E128>0,DGET(Vaktperiode0,E$20,$B121:$B122),0)","v":0},{"$f":"IF(F128>0,DGET(Vaktperiode0,F$20,$B121:$B122),0)","v":0}]
[{"$f":"Vaktliste!$A$2","v":1},"Beløp",null,{"$f":"D129*D128","v":0},{"$f":"E129*E128","v":0},{"$f":"F129*F128","v":0},null,{"$f":"SUM(D130:F130)","v":0}]
["X","Vaktperiode",null,"Ordinær"]
[{"$f":"Vaktliste!$A$2","v":1},"4e",null,{"$f":"$C$14","v":"nn0"}]
["X","Vaktperiode",null,null,"Sesong"]
[{"$f":"Vaktliste!$A$2","v":1},{"$f":"B132","v":"4e"},null,null,{"$f":"$C$14","v":"nn0"}]
["X","Vaktperiode",null,null,null,null,"Vakans"]
[{"$f":"Vaktliste!$A$2","v":1},{"$f":"B134","v":"4e"},null,null,null,null,{"$f":"$C$14","v":"nn0"}]
["X",{"$f":"VLOOKUP(B132,Vaktperioder,2,0)","v":"Natt hellig- og høytidsdag 2200 - 2400"},null,{"$f":"DCOUNTA(Vaktliste,5,$A131:$G132)","v":0},{"$f":"DCOUNTA(Vaktliste,6,$A133:$G134)","v":0},{"$f":"DCOUNTA(Vaktliste,7,$A135:$G136)","v":0}]
[{"$f":"Vaktliste!$A$2","v":1},"Timer",null,{"$f":"D137*DGET(Timer,3,$B131:$B132)","v":0},{"$f":"E137*DGET(Timer,3,$B131:$B132)","v":0},{"$f":"F137*DGET(Timer,3,B131:B132)","v":0}]
["X","Satser",null,{"$f":"IF(D138>0,DGET(Vaktperiode0,D$20,$B131:$B132),0)","v":0},{"$f":"IF(E138>0,DGET(Vaktperiode0,E$20,$B131:$B132),0)","v":0},{"$f":"IF(F138>0,DGET(Vaktperiode0,F$20,$B131:$B132),0)","v":0}]
[{"$f":"Vaktliste!$A$2","v":1},"Beløp",null,{"$f":"D139*D138","v":0},{"$f":"E139*E138","v":0},{"$f":"F139*F138","v":0},null,{"$f":"SUM(D140:F140)","v":0}]
["X","Vaktperiode",null,"Ordinær"]
[{"$f":"Vaktliste!$A$2","v":1},"4f",null,{"$f":"$C$14","v":"nn0"}]
["X","Vaktperiode",null,null,"Sesong"]
[{"$f":"Vaktliste!$A$2","v":1},{"$f":"B142","v":"4f"},null,null,{"$f":"$C$14","v":"nn0"}]
["X","Vaktperiode",null,null,null,null,"Vakans"]
[{"$f":"Vaktliste!$A$2","v":1},{"$f":"B144","v":"4f"},null,null,null,null,{"$f":"$C$14","v":"nn0"}]
["X",{"$f":"VLOOKUP(B142,Vaktperioder,2,0)","v":"Natt hellig- og høytidsdag 0000 - 0600"},null,{"$f":"DCOUNTA(Vaktliste,5,$A141:$G142)","v":0},{"$f":"DCOUNTA(Vaktliste,6,$A143:$G144)","v":0},{"$f":"DCOUNTA(Vaktliste,7,$A145:$G146)","v":0}]
[{"$f":"Vaktliste!$A$2","v":1},"Timer",null,{"$f":"D147*DGET(Timer,3,$B141:$B142)","v":0},{"$f":"E147*DGET(Timer,3,$B141:$B142)","v":0},{"$f":"F147*DGET(Timer,3,B141:B142)","v":0}]
["X","Satser",null,{"$f":"IF(D148>0,DGET(Vaktperiode0,D$20,$B141:$B142),0)","v":0},{"$f":"IF(E148>0,DGET(Vaktperiode0,E$20,$B141:$B142),0)","v":0},{"$f":"IF(F148>0,DGET(Vaktperiode0,F$20,$B141:$B142),0)","v":0}]
[{"$f":"Vaktliste!$A$2","v":1},"Beløp",null,{"$f":"D149*D148","v":0},{"$f":"E149*E148","v":0},{"$f":"F149*F148","v":0},null,{"$f":"SUM(D150:F150)","v":0}]
[null,"Sum antall vakter / beløp",null,{"$f":"D28+D38+D48+D58+D68+D78+D88+D98+D108+D118+D128+D138+D148","v":0},{"$f":"E28+E38+E48+E58+E68+E78+E88+E98+E108+E118+E128+E138+E148","v":0},{"$f":"F28+F38+F48+F58+F68+F78+F88+F98+F108+F118+F128+F138+F148","v":0},null,{"$f":"SUM(H27:H150)","v":0}]

{"sheet":"Vaktperiode","index":11,"n_rows":31,"n_cols":9,"rows_kept":31,"cut":false,"hidden":false,"merged":[]}
["Vaktperiode",null,"Timer","Ordinær","Sesong","Vakans"]
["1a","Hverdag, kveld 1600 - 2200",6,139.26999999999998,93.16,{"$f":"D2*0.5","v":69.634999999999991}]
["2a","Hverdag, morgen 0600 - 0800",2,139.26999999999998,93.16,{"$f":"D3*0.5","v":69.634999999999991}]
["3a","Lørdag, søndag 0600 - 2200",16,184.85,137.94,92.424999999999997]
["3b","Hellig- og høytidsdag 0600 - 2200",16,214.13,140.66999999999999,107.065]
["3c","Jul- og nyttårsaften 0600 - 1200",6,214.13,140.66999999999999,107.065]
["3d","Påske-, jul- og nyttårsaften 1200 - 2200",10,214.13,140.66999999999999,107.065]
["3e","Påskeaften 0600 - 1200",6,184.85,137.94,92.424999999999997]
["4a","Natt hverdag 2200 - 2400",2,139.26999999999998,93.16,69.634999999999991]
["4b","Natt hverdag 0000 - 0600",6,139.26999999999998,93.16,69.634999999999991]
["4c","Natt lørdag, søndag 2200 - 2400",2,184.85,137.94,92.424999999999997]
["4d","Natt lørdag, søndag 0000 - 0600",6,184.85,137.94,92.424999999999997]
["4e","Natt hellig- og høytidsdag 2200 - 2400",2,214.13,140.66999999999999,107.065]
["4f","Natt hellig- og høytidsdag 0000 - 0600",6,214.13,140.66999999999999,107.065]
[]
[]
[]
[null,"Perioder"]
[null,"2026-01-01"]
[null,"2026-02-01"]
[null,"2026-03-01"]
[null,"2026-04-01"]
[null,"2026-05-01",null,null,null,null,null,null,"|"]
[null,"2026-06-01"]
[null,"2026-07-01"]
[null,"2026-08-01"]
[null,"2026-09-01"]
[null,"2026-10-01"]
[null,"2026-11-01"]
[null,"2026-12-01"]
[null,""]

{"sheet":"Mottaker av faktura","index":13,"n_rows":17,"n_cols":4,"rows_kept":17,"cut":false,"hidden":false,"merged":[[16,1,16,2],[19,1,19,3]]}
[]
[null,"GODTGJØRING FOR DELTAKELSE I KLINISK VETERINÆRVAKT"]
[]
[null,"Faktura nr.","……………………………","for 2026"]
[]
[null,"Fakturadato","……………………………"]
[null,"(dd.mm.åååå)"]
[]
[]
[null,"Forfallsdato","……………………………"]
[null,"(dd.mm.åååå)"]
[]
[]
[]
[]
[]
[null,"Mottakers navn og adresse"]